Gold, compound with aluminum (1:1)
- Formula: AlAu
- Molecular weight: 223.948108
- IUPAC Standard InChIKey: IUQRRRJWXRCUTI-UHFFFAOYSA-N
- CAS Registry Number: 12250-38-3
- Chemical structure:
View 3d structure (requires JavaScript / HTML 5) - Information on this page:

Gas phase ion energetics data

Data compiled as indicated in comments:
LLK - Sharon G. Lias, Rhoda D. Levin, and Sherif A. Kafafi
Ionization energy determinations
IE (eV) | Method | Reference | Comment |
---|---|---|---|
7.6 ± 0.3 | EI | Stearns and Kohl, 1973 | LLK |
7.6 ± 0.3 | EI | Stearns and Kohl, 1973, 2 | LLK |
7.8 ± 0.3 | EI | Cocke and Gingerich, 1971 | LLK |

References

Stearns and Kohl, 1973
Stearns, C.A.; Kohl, F.J.,
Mass spectrometric determination of the dissociation energies of AlC2, Al2C2, and AlAuC2,
J. Phys. Chem., 1973, 77, 136. [all data]
Stearns and Kohl, 1973, 2
Stearns, C.A.; Kohl, F.J.,
Mass spectrometric determination of the dissociation energies of gaseous Al2, AlSi, and AlSiO,
High Temp. Sci., 1973, 5, 113. [all data]
Cocke and Gingerich, 1971
Cocke, D.L.; Gingerich, K.A.,
Mass spectrometric determination of the dissociation energies of the molecules Ho2, HoAg, and HoAu,
J. Phys. Chem., 1971, 75, 3264. [all data]