m-Cresyl acetate
- Formula: C9H10O2
- Molecular weight: 150.1745
- IUPAC Standard InChIKey: OTGAHJPFNKQGAE-UHFFFAOYSA-N
- CAS Registry Number: 122-46-3
- Chemical structure:
View 3d structure (requires JavaScript / HTML 5) - Other names: Acetic acid, m-tolyl ester; m-Acetoxytoluene; m-Cresol acetate; m-Methylphenyl acetate; m-Tolyl acetate; Cresatin; Cresatin-Sulzberger; Kresatin; Metacresol acetate; 3-Methylphenyl acetate; 3-Methylphenyl ester of acetic acid; Acetic acid m-cresol ester; Acetylmetacresol; m-Cresol acetic acid ester; Acetic acid, m-methylphenyl ester; Acetic acid, 3-methylphenyl ester; 3-Acetoxytoluene; 3-Methylphenol acetate; NSC 4795; 3-Tolyl acetate

Phase change data

Data compiled as indicated in comments:
BS - Robert L. Brown and Stephen E. Stein
AC - William E. Acree, Jr., James S. Chickos
Quantity | Value | Units | Method | Reference | Comment |
---|---|---|---|---|---|
Tboil | 485.2 | K | N/A | Weast and Grasselli, 1989 | BS |
Enthalpy of vaporization
ΔvapH (kJ/mol) | Temperature (K) | Method | Reference | Comment |
---|---|---|---|---|
55.7 | 400. | A,EB | Stephenson and Malanowski, 1987 | Based on data from 385. to 480. K. See also Sheehan and Langer, 1969.; AC |
Enthalpy of sublimation
ΔsubH (kJ/mol) | Temperature (K) | Method | Reference | Comment |
---|---|---|---|---|
60.7 | 295. | TE | Balson, 1947 | Based on data from 274. to 317. K. See also Jones, 1960.; AC |

Reaction thermochemistry data

Data compiled by: Hussein Y. Afeefy, Joel F. Liebman, and Stephen E. Stein
Individual Reactions
By formula: C9H10O2 + H2O = C7H8O + C2H4O2
Quantity | Value | Units | Method | Reference | Comment |
---|---|---|---|---|---|
ΔrH° | -18.4 ± 0.59 | kJ/mol | Cm | Sunner, 1957 | liquid phase; Heat of hydrolysis |

Gas phase ion energetics data

Data compiled by: Sharon G. Lias, Rhoda D. Levin, and Sherif A. Kafafi
Ionization energy determinations
IE (eV) | Method | Reference |
---|---|---|
9.0 ± 0.2 | EI | Gamble, Gilbert, et al., 1971 |
Appearance energy determinations
Ion | AE (eV) | Other Products | Method | Reference | Comment |
---|---|---|---|---|---|
C2H3O+ | 13.8 ± 0.2 | C6H4(CH3)O | EI | Gamble, Gilbert, et al., 1971 | |
C7H8O+ | 10.0 ± 0.2 | CH2=C=O | EI | Gamble, Gilbert, et al., 1971 |

Van Den Dool and Kratz RI, non-polar column, temperature ramp

Column type | Active phase | I | Reference | Comment |
---|---|---|---|---|
Capillary | ZB-1 | 1136. | Urbanczyk, Staniewski, et al., 2002 | 30. m/0.25 mm/0.50 μm, He, 50. C @ 3. min, 10. K/min, 280. C @ 10. min |

Van Den Dool and Kratz RI, non-polar column, custom temperature program

Column type | Active phase | I | Reference | Comment |
---|---|---|---|---|
Packed | SE-30 | 1144. | Peng, Ding, et al., 1988 | Supelcoport; Chromosorb; Column length: 3.05 m; Program: 40C(5min) => 10C/min => 200C or 250C (60min) |

Normal alkane RI, polar column, custom temperature program

Column type | Active phase | I | Reference | Comment |
---|---|---|---|---|
Capillary | DB-Wax | 1756. | Peng, Yang, et al., 1991 | Program: not specified |

References

Weast and Grasselli, 1989
CRC Handbook of Data on Organic Compounds, 2nd Editon, Weast,R.C and Grasselli, J.G., ed(s)., CRC Press, Inc., Boca Raton, FL, 1989, 1. [all data]
Stephenson and Malanowski, 1987
Stephenson, Richard M.; Malanowski, Stanislaw,
Handbook of the Thermodynamics of Organic Compounds, 1987, https://doi.org/10.1007/978-94-009-3173-2
. [all data]
Sheehan and Langer, 1969
Sheehan, Richard J.; Langer, Stanley H.,
Vapor pressures of fluorine- and silicon-containing derivatives of some hydroxylic compounds,
J. Chem. Eng. Data, 1969, 14, 2, 248-250, https://doi.org/10.1021/je60041a011
. [all data]
Balson, 1947
Balson, E.W.,
Studies in vapour pressure measurement, Part III.?An effusion manometer sensitive to 5 «65533» 10?6 millimetres of mercury: vapour pressure of D.D.T. and other slightly volatile substances,
Trans. Faraday Soc., 1947, 43, 54, https://doi.org/10.1039/tf9474300054
. [all data]
Jones, 1960
Jones, A.H.,
Sublimation Pressure Data for Organic Compounds.,
J. Chem. Eng. Data, 1960, 5, 2, 196-200, https://doi.org/10.1021/je60006a019
. [all data]
Sunner, 1957
Sunner, S.,
The heat of hydrolysis of i-propenyl acetate and m-cresyl acetate and the heat of formation of acetone,
Acta Chem. Scand., 1957, 11, 1757-1760. [all data]
Gamble, Gilbert, et al., 1971
Gamble, A.A.; Gilbert, J.R.; Tillett, J.G.,
Substituent effects on the mass spectra of substituted phenyl acetates,
Org. Mass Spectrom., 1971, 5, 1093. [all data]
Urbanczyk, Staniewski, et al., 2002
Urbanczyk, A.; Staniewski, J.; Szymanowski, J.,
Abraham model in gas chromatography of phenol pollutants,
Anal. Chim. Acta., 2002, 466, 1, 151-159, https://doi.org/10.1016/S0003-2670(02)00544-5
. [all data]
Peng, Ding, et al., 1988
Peng, C.T.; Ding, S.F.; Hua, R.L.; Yang, Z.C.,
Prediction of Retention Indexes I. Structure-Retention Index Relationship on Apolar Columns,
J. Chromatogr., 1988, 436, 137-172, https://doi.org/10.1016/S0021-9673(00)94575-8
. [all data]
Peng, Yang, et al., 1991
Peng, C.T.; Yang, Z.C.; Ding, S.F.,
Prediction of rentention idexes. II. Structure-retention index relationship on polar columns,
J. Chromatogr., 1991, 586, 1, 85-112, https://doi.org/10.1016/0021-9673(91)80028-F
. [all data]