Acetamide, N-(3-nitrophenyl)-
- Formula: C8H8N2O3
- Molecular weight: 180.1607
- IUPAC Standard InChIKey: KFTYNYHJHKCRKU-UHFFFAOYSA-N
- CAS Registry Number: 122-28-1
- Chemical structure:

Phase change data

Data compiled by: Thermodynamics Research Center, NIST Boulder Laboratories, Chris Muzny director
Quantity | Value | Units | Method | Reference | Comment |
---|---|---|---|---|---|
Tfus | 427.7 | K | N/A | Sidgwick and Rubie, 1921 | Uncertainty assigned by TRC = 0.5 K |

Gas phase ion energetics data

Data compiled by: Henry M. Rosenstock, Keith Draxl, Bruce W. Steiner, and John T. Herron
Ionization energy determinations
IE (eV) | Method | Reference |
---|---|---|
8.8 ± 0.2 | EI | Gamble, Gilbert, et al., 1970 |
Appearance energy determinations
Ion | AE (eV) | Other Products | Method | Reference | Comment |
---|---|---|---|---|---|
C6H6N2O2+ | 10.5 ± 0.2 | ? | EI | Gamble, Gilbert, et al., 1970 |

References

Sidgwick and Rubie, 1921
Sidgwick, N.V.; Rubie, H.E.,
The solubility and volatility of the chloro- and nitro-anilines and of their acetyl derivatives,
J. Chem. Soc., 1921, 119, 1013-24. [all data]
Gamble, Gilbert, et al., 1970
Gamble, A.A.; Gilbert, J.R.; Tillett, J.G.,
Substituent effects in the fragmentation of acetanilides,,
J. Chem. Soc. B, 1970, 1231. [all data]