Iron, tetra-μ3-carbonyltetrakis(η5-2,4-cyclopentadien-1-yl)tetra-, tetrahedro
- Formula: C24H20Fe4O4
- Molecular weight: 595.793
- IUPAC Standard InChIKey: UFXYSXFDUMQEFJ-UHFFFAOYSA-N
- CAS Registry Number: 12203-87-1
- Chemical structure:
View 3d structure (requires JavaScript / HTML 5) - Other names: Iron, tetra-μ3-carbonyltetra-π-cyclopentadienyltetra-, tetrahedro-; Cyclopentadienyliron carbonyl tetramer

Gas phase ion energetics data

Data compiled by: Sharon G. Lias, Rhoda D. Levin, and Sherif A. Kafafi
Ionization energy determinations
IE (eV) | Method | Reference | Comment |
---|---|---|---|
6.45 | PE | Symon and Waddington, 1975 | Vertical value |

References

Symon and Waddington, 1975
Symon, D.A.; Waddington, T.C.,
Valence-band photoelectron spectra of some dicarbonyl(η-cyclopentadienyl)(ligand)iron compounds and tetrakis [carbonyl(η-cyclopentadienyl)iron(1)],
J. Chem. Soc. Dalton Trans., 1975, 2140. [all data]