Benzoyl chloride, 4-chloro-
- Formula: C7H4Cl2O
- Molecular weight: 175.012
- IUPAC Standard InChIKey: RKIDDEGICSMIJA-UHFFFAOYSA-N
- CAS Registry Number: 122-01-0
- Chemical structure:
View 3d structure (requires JavaScript / HTML 5) - Other names: Benzoyl chloride, p-chloro-; p-Chlorobenzoyl chloride; 4-Chlorobenzoic acid chloride; 4-Chlorobenzoyl chloride; para-Chlorobenzoyl chloride

Gas phase thermochemistry data

Data compiled by: Hussein Y. Afeefy, Joel F. Liebman, and Stephen E. Stein
Quantity | Value | Units | Method | Reference | Comment |
---|---|---|---|---|---|
ΔfH°gas | -128.9 ± 4.3 | kJ/mol | Cm | Guthrie, Pike, et al., 1992 | Hydrolysis |

Condensed phase thermochemistry data

Data compiled by: Hussein Y. Afeefy, Joel F. Liebman, and Stephen E. Stein
Quantity | Value | Units | Method | Reference | Comment |
---|---|---|---|---|---|
ΔfH°liquid | -191.7 ± 1.1 | kJ/mol | Cm | Guthrie, Pike, et al., 1992 | Hydrolysis |
ΔfH°liquid | -190.9 ± 0.88 | kJ/mol | Cm | Moselhy and Pritchard, 1975 |

Phase change data

Data compiled as indicated in comments:
BS - Robert L. Brown and Stephen E. Stein
AC - William E. Acree, Jr., James S. Chickos
Quantity | Value | Units | Method | Reference | Comment |
---|---|---|---|---|---|
Tboil | 495.2 | K | N/A | Weast and Grasselli, 1989 | BS |
Enthalpy of vaporization
ΔvapH (kJ/mol) | Temperature (K) | Method | Reference | Comment |
---|---|---|---|---|
55.7 | 381. | A | Stephenson and Malanowski, 1987 | Based on data from 370. to 392. K. See also Dykyj, Svoboda, et al., 1999.; AC |

Reaction thermochemistry data

Data compiled by: Hussein Y. Afeefy, Joel F. Liebman, and Stephen E. Stein
Individual Reactions
By formula: C7H4Cl2O + H2O = C7H5ClO2 + HCl
Quantity | Value | Units | Method | Reference | Comment |
---|---|---|---|---|---|
ΔrH° | -43.74 ± 0.42 | kJ/mol | Cm | Moselhy and Pritchard, 1975 | liquid phase; solvent: Diphenyl-ether |

Gas phase ion energetics data

Data compiled by: Henry M. Rosenstock, Keith Draxl, Bruce W. Steiner, and John T. Herron
Ionization energy determinations
IE (eV) | Method | Reference |
---|---|---|
9.58 ± 0.03 | EI | Foffani, Pignataro, et al., 1964 |

References

Guthrie, Pike, et al., 1992
Guthrie, J.P.; Pike, D.C.; Lee, Y.-C.,
Equilibrium constants and heats of formation of methyl esters and N,N-dimethyl amides of substituted benzoic acids,
Can. J. Chem., 1992, 70, 1671-1683. [all data]
Moselhy and Pritchard, 1975
Moselhy, G.M.; Pritchard, H.O.,
The thermochemistry of the chloro-benzoyl chlorides,
J. Chem. Thermodyn., 1975, 7, 977-982. [all data]
Weast and Grasselli, 1989
CRC Handbook of Data on Organic Compounds, 2nd Editon, Weast,R.C and Grasselli, J.G., ed(s)., CRC Press, Inc., Boca Raton, FL, 1989, 1. [all data]
Stephenson and Malanowski, 1987
Stephenson, Richard M.; Malanowski, Stanislaw,
Handbook of the Thermodynamics of Organic Compounds, 1987, https://doi.org/10.1007/978-94-009-3173-2
. [all data]
Dykyj, Svoboda, et al., 1999
Dykyj, J.; Svoboda, J.; Wilhoit, R.C.; Frenkel, M.L.; Hall, K.R.,
Vapor Pressure of Chemicals: Part A. Vapor Pressure and Antoine Constants for Hydrocarbons and Sulfur, Selenium, Tellurium and Hydrogen Containing Organic Compounds, Springer, Berlin, 1999, 373. [all data]
Foffani, Pignataro, et al., 1964
Foffani, A.; Pignataro, S.; Cantone, B.; Grasso, F.,
Ionization potentials and substituent effects for aromatic carbonyl compounds,
Z. Physik. Chem. (Frankfurt), 1964, 42, 221. [all data]