2,2-Dimethyldeca-3,4-diene
- Formula: C12H22
- Molecular weight: 166.3031
- IUPAC Standard InChIKey: RLYOJWAFNPKWRK-UHFFFAOYSA-N
- CAS Registry Number: 121959-79-3
- Chemical structure:
View 3d structure (requires JavaScript / HTML 5) - Permanent link for this species. Use this link for bookmarking this species for future reference.

Gas phase ion energetics data

Data compiled by: Henry M. Rosenstock, Keith Draxl, Bruce W. Steiner, and John T. Herron
Appearance energy determinations
Ion | AE (eV) | Other Products | Method | Reference | Comment |
---|---|---|---|---|---|
C4H9+ | 12.0 ± 0.05 | ? | EI | Berkowitz, Chupka, et al., 1956 | |
C8H13+ | 10.1 ± 0.05 | ? | EI | Polyakova, Khmel'nitskii, et al., 1963 |

References

Berkowitz, Chupka, et al., 1956
Berkowitz, J.; Chupka, W.A.; Kistiakowsky, G.B.,
Mass spectrometric study of the kinetics of nitrogen afterglow,
J. Chem. Phys., 1956, 25, 457. [all data]
Polyakova, Khmel'nitskii, et al., 1963
Polyakova, A.A.; Khmel'nitskii, R.A.; Petrov, A.A.,
Mass spectra and the structure of organic compounds. VIII. Mass spectra of some allene hydrocarbons containing t-butyl groups,
Zh. Obshch. Khim., 1963, 33, 2518, In original 2455. [all data]