Iron, tricarbonyliodo(η3-2-propenyl)-
- Formula: C6H5FeIO3
- Molecular weight: 307.852
- CAS Registry Number: 12189-10-5

Gas phase thermochemistry data

Data compiled by: José A. Martinho Simões
Quantity | Value | Units | Method | Reference | Comment |
---|---|---|---|---|---|
ΔfH°gas | -80.5 ± 2.4 | kcal/mol | Review | Martinho Simões | |
ΔfH°gas | -82.1 ± 2.6 | kcal/mol | HAL-HFC | Connor, Demain, et al., 1979 | Value corrected based on a set of ancillary data by J.A. Martinho Simões; Selected data. The enthalpy of formation is a recommended Connor, Demain, et al., 1979 weighed average from thermal decomposition and iodination results |

Condensed phase thermochemistry data

Data compiled by: José A. Martinho Simões
Quantity | Value | Units | Method | Reference | Comment |
---|---|---|---|---|---|
ΔfH°solid | -100.7 ± 2.2 | kcal/mol | Review | Martinho Simões | |
ΔfH°solid | -102.3 ± 2.4 | kcal/mol | HAL-HFC | Connor, Demain, et al., 1979 | Value corrected based on a set of ancillary data by J.A. Martinho Simões; Selected data. The enthalpy of formation is a recommended Connor, Demain, et al., 1979 weighed average from thermal decomposition and iodination results |

Gas phase ion energetics data

Data compiled as indicated in comments:
LBLHLM - Sharon G. Lias, John E. Bartmess, Joel F. Liebman, John L. Holmes, Rhoda D. Levin, and W. Gary Mallard
Ionization energy determinations
IE (eV) | Method | Reference | Comment |
---|---|---|---|
8.2 | PE | Louwen, Hart, et al., 1982 | LBLHLM |
8.36 | PE | Louwen, Hart, et al., 1982 | Vertical value; LBLHLM |

Phase change data

Data compiled as indicated in comments:
AC - William E. Acree, Jr., James S. Chickos
MS - José A. Martinho Simões

Quantity Value Units Method Reference Comment
Δsub20.2 ± 0.96kcal/molN/APilcher and Skinner, 1983See also Connor, Demain, et al., 1979.; AC
Δsub20.2 ± 0.96kcal/molTD-HFCConnor, Demain, et al., 1979, 2MS

References

Martinho Simões
Martinho Simões, J.A.,
Private communication (see http://webbook.nist.gov/chemistry/om/). [all data]
Connor, Demain, et al., 1979
Connor, J.A.; Demain, C.P.; Skinner, H.A.; Zafarani-Moattar, M.T.,
J. Orgnometal. Chem., 1979, 170, 117. [all data]
Louwen, Hart, et al., 1982
Louwen, J.N.; Hart, J.; Stufkens, D.J.; Oskam, A.,
The HeI and HeII photoelectron spectra of [Fe η3-C3H5(CO)3X] and [Fe η3-C4H7(CO)3X] (X = Cl, Br, I) and [CoC3H5(CO)3],
Z. Naturforsch. B:, 1982, 37, 179. [all data]