Barium tetraoxotungstate
- Formula: BaO4W
- Molecular weight: 385.16
- IUPAC Standard InChIKey: SJPVUFMOBDBTHQ-UHFFFAOYSA-N
- CAS Registry Number: 121855-89-8
- Chemical structure:
View 3d structure (requires JavaScript / HTML 5) - Permanent link for this species. Use this link for bookmarking this species for future reference.

Gas phase ion energetics data

Data compiled by: Henry M. Rosenstock, Keith Draxl, Bruce W. Steiner, and John T. Herron
Ionization energy determinations
IE (eV) | Method | Reference |
---|---|---|
9.8 ± 0.5 | EI | Pupp, Yamdagni, et al., 1969 |
Appearance energy determinations
Ion | AE (eV) | Other Products | Method | Reference | Comment |
---|---|---|---|---|---|
BaO+ | 12.6 ± 0.5 | ? | EI | Pupp, Yamdagni, et al., 1969 | |
BaWO3+ | 14.0 ± 0.5 | O | EI | Pupp, Yamdagni, et al., 1969 |

References

Pupp, Yamdagni, et al., 1969
Pupp, C.; Yamdagni, R.; Porter, R.F.,
Mass spectrometric study of the evaporation of BaMoO4 and BaWO4,
J. Inorg. Nucl. Chem., 1969, 31, 2021. [all data]