Dihelium
- Formula: He2
- Molecular weight: 8.005204
- IUPAC Standard InChIKey: GHVQTHCLRQIINU-UHFFFAOYSA-N
- CAS Registry Number: 12184-98-4
- Chemical structure:
View 3d structure (requires JavaScript / HTML 5) - Permanent link for this species. Use this link for bookmarking this species for future reference.

Gas phase ion energetics data

Data compiled as indicated in comments:
LLK - Sharon G. Lias, Rhoda D. Levin, and Sherif A. Kafafi
Ionization energy determinations
IE (eV) | Method | Reference | Comment |
---|---|---|---|
22.223 | DER | Huber and Herzberg, 1979 | LLK |

Constants of diatomic molecules

Data compiled by: Klaus P. Huber and Gerhard H. Herzberg
Data collected through November, 1976
Symbol | Meaning |
---|---|
State | electronic state and / or symmetry symbol |
Te | minimum electronic energy (cm-1) |
ωe | vibrational constant – first term (cm-1) |
ωexe | vibrational constant – second term (cm-1) |
ωeye | vibrational constant – third term (cm-1) |
Be | rotational constant in equilibrium position (cm-1) |
αe | rotational constant – first term (cm-1) |
γe | rotation-vibration interaction constant (cm-1) |
De | centrifugal distortion constant (cm-1) |
βe | rotational constant – first term, centrifugal force (cm-1) |
re | internuclear distance (Å) |
Trans. | observed transition(s) corresponding to electronic state |
ν00 | position of 0-0 band (units noted in table) |
State | Te | ωe | ωexe | ωeye | Be | αe | γe | De | βe | re | Trans. | ν00 |
---|---|---|---|---|---|---|---|---|---|---|---|---|
Rydberg | Rydberg series of npπ 3Πg levels (b,e,i,l,p,r,s,t,u,...) | |||||||||||
ν 1 = 34302.20 - R/n=0.071)2, n=2...17 | ||||||||||||
↳Ginter and Ginter, 1968; Rosen, 1970 | ||||||||||||
Rydberg series of npσ 3Σg+ levels (c,g,k',n,p',r',s',t',...) | ||||||||||||
ν 1 = 34302.20 - R/n=0.777)2, n=3...12 | ||||||||||||
↳Ginter and Ginter, 1968; Rosen, 1970 | ||||||||||||
u 3Πg 10pπ | 177291 | [1628.69] 2Z | (35.25) | 7.212 2 | 0.222 2 | [0.000503] 2 | 1.081 | u → a R | 33189.16 Z | |||
↳Ginter and Ginter, 1968 | ||||||||||||
State | Te | ωe | ωexe | ωeye | Be | αe | γe | De | βe | re | Trans. | ν00 |
t' 3Σg+ 10pσ | [177969] | [8.27] 3 | t' → a V | 33026.6 Z | ||||||||
↳Ginter and Ginter, 1968 | ||||||||||||
t 3Πg 9pπ | 177027 | [1629.15] 4 Z | (35.25) | 7.212 4 | 0.230 4 | [0.000507] 4 | 1.081 | t → a R | 32925.96 Z | |||
↳Ginter and Ginter, 1968 | ||||||||||||
s' 3Σg+ 9pσ | [177636] | [8.04] 3 | s' → a V | 32693.2 Z | ||||||||
↳Ginter and Ginter, 1968 | ||||||||||||
s 3Πg 8pπ | 176658 | [1629.30] 5 Z | (35.25) | 7.213 5 | 0.2234 5 | 0.00051 5 | 1.0806 | s → a R | 32556.66 Z | |||
↳Ginter and Ginter, 1968 | ||||||||||||
State | Te | ωe | ωexe | ωeye | Be | αe | γe | De | βe | re | Trans. | ν00 |
r' 3Σg+ 8pσ | [177154] | [7.78] 3 | r' → a V | 32211.7 Z | ||||||||
↳Ginter and Ginter, 1968 | ||||||||||||
r 3Πg 7pπ | 176117 | (1700.56) 6 | (35.25) | [7.1044] 6 | 6 | [0.000508] 6 | [1.0889] | r → d R | 11625.3 Z | |||
↳Rosen, 1970 | ||||||||||||
176117 | r → a R | 32016.56 Z | ||||||||||
↳Ginter and Ginter, 1968 | ||||||||||||
p' 3Σg+ 7pσ | [176421] | [7.543] 3 | p' → a | 31478.6 Z | ||||||||
↳Ginter and Ginter, 1968 | ||||||||||||
State | Te | ωe | ωexe | ωeye | Be | αe | γe | De | βe | re | Trans. | ν00 |
q 3Δu 6dδ | [176195] | [7.092] 7 | [0.00050] 7 | [1.0898] | q → c V | 20365 | ||||||
↳Dieke, 1929; Rosen, 1970 | ||||||||||||
q → b V | 26483 | |||||||||||
↳Dieke, 1929; Rosen, 1970 | ||||||||||||
q 3Πu 6dπ | [(176169)] | q → c R | (20330) | |||||||||
↳Dieke, 1929; Rosen, 1970 | ||||||||||||
q → b R | (26466) | |||||||||||
↳Dieke, 1929; Rosen, 1970 | ||||||||||||
State | Te | ωe | ωexe | ωeye | Be | αe | γe | De | βe | re | Trans. | ν00 |
q 3Σu+ 6dσ | [176120] | [] 7 | q → c R | 20288 | ||||||||
↳Dieke, 1929; Rosen, 1970 | ||||||||||||
q → b R | 26409 | |||||||||||
p 3Πg 6pπ | 175281 | 1701.18 Z | 35.35 | 7.220 8 | 0.224 | 0.000514 | 1.0801 | p → d R | 10788.68 Z | |||
↳Rosen, 1970 | ||||||||||||
175281 | p → a R | 31179.93 Z | ||||||||||
↳Ginter and Ginter, 1968 | ||||||||||||
State | Te | ωe | ωexe | ωeye | Be | αe | γe | De | βe | re | Trans. | ν00 |
o 3Σu+ 6sσ | [176001] | [7.109] | [0.00051] | [1.0885] | o → c V | 20168.8 Z | ||||||
↳missing citation | ||||||||||||
[176001] | o → b R | 26290.3 Z | ||||||||||
↳Dieke, Imanishi, et al., 1929; Rosen, 1970 | ||||||||||||
n 3Σg+ 6pσ | 174389 | [1619.52] Z | (36.5) | 7.4754 9 | 0.2490 | [0.000721] 10 | 1.0615 | n → a | 30283.26 Z | |||
↳Jevons, 1932; Orth and Ginter, 1976 | ||||||||||||
m 3Δu 5dδ | [174863] | [7.09] 11 | [1.091] | m → c V | (19039) | |||||||
↳Rosen, 1970 | ||||||||||||
m → b V | (25152) | |||||||||||
↳Rosen, 1970 | ||||||||||||
State | Te | ωe | ωexe | ωeye | Be | αe | γe | De | βe | re | Trans. | ν00 |
m 3Πu 5dπ | 174778 | [7.07] 12 | m → c R | (18944) | ||||||||
↳Rosen, 1970 | ||||||||||||
m → b R | (25070) | |||||||||||
↳Rosen, 1970 | ||||||||||||
m 3Σu+ 5dσ | [174730] | m → c R | 18899 | |||||||||
↳Rosen, 1970 | ||||||||||||
m → b R | 25019 | |||||||||||
↳Rosen, 1970 | ||||||||||||
State | Te | ωe | ωexe | ωeye | Be | αe | γe | De | βe | re | Trans. | ν00 |
l 3Πg 5pπ | 173884 | [1633.96] 13 Z | (35.25) | 7.226 13 | 0.222 13 | [0.000512] 13 | 1.0797 | l → d R | 9393.9 Z | |||
↳Rosen, 1970 | ||||||||||||
29785.31 Z | ||||||||||||
↳Ginter and Ginter, 1968 | ||||||||||||
k 3Σu+ 5sσ | (173698) | [1635.3] Z | 7.232 | 0.23 | 1.079 | k → c V | 18683.5 Z | |||||
↳Rosen, 1970 | ||||||||||||
k → b R | 24804.8 Z | |||||||||||
↳Rosen, 1970 | ||||||||||||
State | Te | ωe | ωexe | ωeye | Be | αe | γe | De | βe | re | Trans. | ν00 |
k' 3Σg+ 5pσ | 172236 | 1686.90 Z | 38.10 | 7.379 14 | 0.349 15 | [5.8E-4] | 1.0684 | k' → a R | 28127.58 Z | |||
↳Orth and Ginter, 1976 | ||||||||||||
j 3Δu 4dδ | 171573 | 1702.24 16Z | 35.07 | 7.2088 16 | 0.2248 17 | 5.2E-4 16 | 1.0810 | j → c V | 16583.18 16Z | |||
↳Brown and Ginter, 1973 | ||||||||||||
j → b V | 22704.5 16Z | |||||||||||
↳Brown and Ginter, 1973 | ||||||||||||
j 3Πu 4dπ | 171402 | 1680.94 16 Z | 40.81 | 7.1860 16 | 0.2296 18 | 5.4E-4 16 | 1.0827 | j → c R | 16400.69 16 Z | |||
↳Brown and Ginter, 1973 | ||||||||||||
j → b R | 22522.0 16 Z | |||||||||||
↳Brown and Ginter, 1973 | ||||||||||||
State | Te | ωe | ωexe | ωeye | Be | αe | γe | De | βe | re | Trans. | ν00 |
j 3Σu+ 4dσ | 171323 | 1669.79 19 | 39.09 | j → c R | 16316.54 19 Z | |||||||
↳Brown and Ginter, 1973 | ||||||||||||
j 3Σu+ 4dσ 20 | j → b R | 22437.8 19 Z | ||||||||||
↳Brown and Ginter, 1973 | ||||||||||||
i 3Πg 4pπ | 171290 | [1637.94] 21Z | (35.25) | 7.242 21 | 0.223 21 | [5.14E-4] 21 | 1.0785 | i → a R | 27193.01 Z | |||
↳Ginter and Ginter, 1968; Rosen, 1970 | ||||||||||||
h 3Σu+ 4sσ | (170884) | [1637.9] Z | 7.264 22 | 0.23 | (5.24E-4) | 1.077 | h → c V | 15870.7 Z | ||||
↳Dieke, Imanishi, et al., 1929; Rosen, 1970; Brown and Ginter, 1973 | ||||||||||||
h → b R | 21992.2 Z | |||||||||||
↳Dieke, Imanishi, et al., 1929; Rosen, 1970; missing citation | ||||||||||||
State | Te | ωe | ωexe | ωeye | Be | αe | γe | De | βe | re | Trans. | ν00 |
g 3Σg+ 4pσ | 167714 | [1589.92] Z | (41) | 7.2207 | 0.2478 | [5.38E-4] 23 | 1.0801 | g → a R | 23597.00 Z | |||
↳Orth and Ginter, 1976 | ||||||||||||
f 3Δu 3dδ | 166303 | 1706.82 Z | 35.10 | 7.230 24 | 0.227 25 | [5.26e-4] 26 | 1.0794 | f → c V | 11316.06 Z | |||
f → b V | 17437.3 Z | |||||||||||
↳missing citation | ||||||||||||
f 3Πu 3dπ | 165877 27 | 1661.48 Z | 44.79 | 7.136 24 | 0.235 28 | [5.34E-4] 29 | 1.0865 | f → c | 10864.53 Z | |||
↳Ginter, 1966 | ||||||||||||
f → b | 16985.8 Z | |||||||||||
↳Ginter, 1965; Rosen, 1970 | ||||||||||||
State | Te | ωe | ωexe | ωeye | Be | αe | γe | De | βe | re | Trans. | ν00 |
f 3Σu+ 3dσ | 165685 | 1635.77 Z | 44.41 | 7.071 24 | 0.246 30 | [5.31E-4] 31 | 1.0914 | f → c R | 10659.33 Z | |||
f → b R | 106780.6 Z | |||||||||||
e 3Πg 3pπ | 165598 | 1721.22 Z | 34.970 32 | 7.2838 33 | 0.2215 34 | 5.22E-4 | 1.0754 | ea ↔ 35 R | 21507.26 Z | |||
↳Brown and Ginter, 1971 | ||||||||||||
d 3Σu+ 3pπ | 164479 | 1728.01 Z | 36.13 36 | 7.342 | 0.2244 37 | 5.32E-4 | 1.0712 | d → c V | 9502.7 Z | |||
↳Ginter, 1965 | ||||||||||||
d → b R V | 15623.1 Z | |||||||||||
↳missing citation | ||||||||||||
State | Te | ωe | ωexe | ωeye | Be | αe | γe | De | βe | re | Trans. | ν00 |
c 3Σg+ 3pσ | 155053 | 1583.85 Z | 52.74 38 | 7.0048 | 0.3105 39 | [5.56E-4] 40 | 1.0966 | c → a R | 10889.48 Z | |||
↳Ginter, 1965, 2 | ||||||||||||
b 3Πg 2pπ | 148835 | 1769.07 Z | 35.02 41 | 7.4473 42 | 0.2196 43 | [5.30E-4] 44 | 1.0635 | b → a R | 4768.2 Z | |||
↳Hepner and Herman, 1956; Gloersen and Dieke, 1965 | ||||||||||||
a 3Σu+ 2sσ | 144048 | 1808.56 Z | 38.21 45 46 | 7.7036 47 | 0.2281 48 | 5.56E-4 49 | 1.0457 | (a → X) | 144935 50 | |||
S 1Πg 8pπ | [177515] | (7.21) | (0.22) | (1.081) | S → A R | 30228.6 Z | ||||||
↳Rosen, 1970 | ||||||||||||
State | Te | ωe | ωexe | ωeye | Be | αe | γe | De | βe | re | Trans. | ν00 |
R 1Πg 7pπ | [176983] | (7.22) | (0.22) | (1.080) | R → A R | 29696.4 Z | ||||||
↳Rosen, 1970 | ||||||||||||
P 1Πg 6pπ | [176160] | (7.22) | (0.22) | (1.080) | P → A R | 28873.9 Z | ||||||
↳Rosen, 1970 | ||||||||||||
M 1Δu 5dδ | [(174838)] | [7.09] 51 | [1.091] | M → B | (24050) | |||||||
↳Rosen, 1970 | ||||||||||||
M 1Πu 5dπ | [(174788)] | [7.07] 52 | 1.091 | M → B | (24000) | |||||||
↳Rosen, 1970 | ||||||||||||
State | Te | ωe | ωexe | ωeye | Be | αe | γe | De | βe | re | Trans. | ν00 |
M 1Σu+ 5dσ | [7.07] 52 | 1.091 | M → B | (23960) | ||||||||
↳Rosen, 1970 | ||||||||||||
L 1Πg 5pπ | [174794] | (7.23) | (0.222) | (1.079) | L → A R | 27507.8 Z | ||||||
↳Rosen, 1970 | ||||||||||||
J 1Δu 4dδ | [172416] | [7.097] 53 | [5.0E-4] | [1.0894] | J → C V | 14183.90 53 Z | ||||||
↳Brown and Ginter, 1973 | ||||||||||||
J → B V | 21627.9 53 Z | |||||||||||
↳Brown and Ginter, 1973 | ||||||||||||
State | Te | ωe | ωexe | ωeye | Be | αe | γe | De | βe | re | Trans. | ν00 |
J 1Πu 4dπ | [172290] | [7.080] 53 | [5.4E-4] | [1.0908] | J → C | 14058.37 53 Z | ||||||
↳Brown and Ginter, 1973 | ||||||||||||
J → B | 21502.4 53 Z | |||||||||||
↳Brown and Ginter, 1973 | ||||||||||||
J 1Σu+ 4dσ | [172222] 54 | J → C R | 13990.32 54 Z | |||||||||
↳Brown and Ginter, 1973 | ||||||||||||
J 1Σu+ 4dσ 55 | J → B R | 21434.3 54 Z | ||||||||||
↳Brown and Ginter, 1973 | ||||||||||||
State | Te | ωe | ωexe | ωeye | Be | αe | γe | De | βe | re | Trans. | ν00 |
I 1Πg 4pπ | [172266] | (7.242) | (0.223) | (1.078) | I → A R | 24979.6 Z | ||||||
↳Rosen, 1970 | ||||||||||||
H 1Σu+ 4sσ | [171951] | (7.26) 56 | (0.23) | (1.077) | H → C V | 13719.5 Z | ||||||
↳Rosen, 1970; Brown and Ginter, 1973 | ||||||||||||
H → B R | 21163.5 Z | |||||||||||
↳Rosen, 1970; Brown and Ginter, 1973 | ||||||||||||
F 1Δu 3dδ | 166304 | 1706.59 Z | 35.06 | 7.230 57 | 0.225 58 | [5.20E-4] 59 | 1.0794 | F → B V | 16360.9 Z | |||
↳Ginter, 1965, 3; Ginter, 1966 | ||||||||||||
State | Te | ωe | ωexe | ωeye | Be | αe | γe | De | βe | re | Trans. | ν00 |
F 1Πu 3dπ | 165971 60 | 1670.87 Z | 20.03 | 7.156 57 | 0.235 | [5.24E-4] 61 | 1.0849 | F → B | 16008.3 Z | |||
↳Ginter, 1965, 3; Ginter, 1966 | ||||||||||||
F 1Σu+ 3dσ | (165813) | [1564.25] Z | (10) | 7.098 57 | 0.246 | [5.21E-4] 62 | 1.0894 | F → B R | 15837.5 Z | |||
↳Ginter, 1965, 3; Ginter, 1966 | ||||||||||||
E 1Πg 3pπ | 165911 | 1721.19 Z | 34.76 63 | 7.2705 64 | 0.2156 65 | 5.20E-4 | 1.0764 | E → A R | 19476.61 Z | |||
↳Brown and Ginter, 1971 | ||||||||||||
D 1Σu+ 3sσ | 165085 | 1746.43 Z | 35.54 | 7.365 | 0.2180 66 | 5.24E-4 67 | 1.0694 | D → B 68 R V | 15161.81 Z | |||
↳Ginter, 1965, 3 | ||||||||||||
D → X 69 70 | ||||||||||||
State | Te | ωe | ωexe | ωeye | Be | αe | γe | De | βe | re | Trans. | ν00 |
C 1Σg+ 3pσ | 157415 | 1653.43 Z | 41.04 71 | 7.052 | 0.215 72 | 5.08E-4 73 | 1.0929 | C → A R | 10945.50 Z | |||
↳Ginter, 1965, 2; Rosen, 1970 | ||||||||||||
B 1Πg 2pπ | 149914 | 1765.76 Z | 34.39 74 | 7.403 75 | 0.216 75 | 5.02E-4 75 | 1.0667 | (B-A) | 3501.5 76 | |||
A 1Σu+ 2sσ | 146365 77 | 1861.33 Z | 35.28 78 | 7.7789 | 0.2166 79 | 5.44E-4 | 1.0406 | AX ↔ 80 | 147279 81 | |||
↳Tanaka and Yoshino, 1963; Mies and Smith, 1966; Smith, 1967; Chow, Smith, et al., 1971 | ||||||||||||
X 1Σg+ | 0 82 | 2.97 83 |

References

Huber and Herzberg, 1979
Huber, K.P.; Herzberg, G.,
Molecular Spectra and Molecular Structure. IV. Constants of Diatomic Molecules,, Van Nostrand Reinhold Co., 1979, ,1. [all data]