Cesium hydroxide

Gas phase thermochemistry data

Quantity Value Units Method Reference Comment
Δfgas-164.40kcal/molReviewChase, 1998Data last reviewed in June, 1971
Quantity Value Units Method Reference Comment
gas,1 bar86.219cal/mol*KReviewChase, 1998Data last reviewed in June, 1971

Gas Phase Heat Capacity (Shomate Equation)

Cp° = A + B*t + C*t2 + D*t3 + E/t2
H° − H°298.15= A*t + B*t2/2 + C*t3/3 + D*t4/4 − E/t + F − H
S° = A*ln(t) + B*t + C*t2/2 + D*t3/3 − E/(2*t2) + G
    Cp = heat capacity (cal/mol*K)
    H° = standard enthalpy (kcal/mol)
    S° = standard entropy (cal/mol*K)
    t = temperature (K) / 1000.

View plot Requires a JavaScript / HTML 5 canvas capable browser.

View table.

Temperature (K) 298. - 1200.1200. - 6000.
A 12.2878027.00120
B 29.396012.414730
C -21.47560-0.453352
D 6.2078020.029699
E 0.042572-2.810792
F -169.0500-178.5650
G 93.46479110.5900
H -164.4000-164.4000
ReferenceChase, 1998Chase, 1998
Comment Data last reviewed in June, 1971 Data last reviewed in June, 1971

Gas phase ion energetics data

Data compiled by: Henry M. Rosenstock, Keith Draxl, Bruce W. Steiner, and John T. Herron

Appearance energy determinations

Ion AE (eV) Other Products MethodReferenceComment
Cs2OH+7.10 ± 0.12OHEIEmel'yanov, Gusarov, et al., 1967
Cs2O+7.52 ± 0.14?EIEmel'yanov, Gusarov, et al., 1967

References

Chase, 1998
Chase, M.W., Jr., NIST-JANAF Themochemical Tables, Fourth Edition, J. Phys. Chem. Ref. Data, Monograph 9, 1998, 1-1951. [all data]

Emel'yanov, Gusarov, et al., 1967
Emel'yanov, A.M.; Gusarov, A.V.; Gorokhov, L.N.; Sadovnikova, N.A., Electron-impact studies of the vapors of cesium oxide and hydroxide, Teor. i Eksperim, Khim., 1967, 3, 226, In original 126. [all data]