Calcium monohydroxide
- Formula: CaHO
- Molecular weight: 57.085
- IUPAC Standard InChIKey: KIZFHUJKFSNWKO-UHFFFAOYSA-M
- CAS Registry Number: 12177-67-2
- Chemical structure:
View 3d structure (requires JavaScript / HTML 5) - Permanent link for this species. Use this link for bookmarking this species for future reference.

Gas phase thermochemistry data

Quantity | Value | Units | Method | Reference | Comment |
---|---|---|---|---|---|
ΔfH°gas | -193.88 | kJ/mol | Review | Chase, 1998 | Data last reviewed in December, 1975 |
Quantity | Value | Units | Method | Reference | Comment |
S°gas,1 bar | 235.42 | J/mol*K | Review | Chase, 1998 | Data last reviewed in December, 1975 |
Gas Phase Heat Capacity (Shomate Equation)
Cp° = A + B*t + C*t2 + D*t3 +
E/t2
H° − H°298.15= A*t + B*t2/2 +
C*t3/3 + D*t4/4 − E/t + F − H
S° = A*ln(t) + B*t + C*t2/2 + D*t3/3 −
E/(2*t2) + G
Cp = heat capacity (J/mol*K)
H° = standard enthalpy (kJ/mol)
S° = standard entropy (J/mol*K)
t = temperature (K) / 1000.
View plot Requires a JavaScript / HTML 5 canvas capable browser.
Temperature (K) | 298. to 6000. |
---|---|
A | 49.88332 |
B | 5.942284 |
C | -0.979236 |
D | 0.085153 |
E | -0.625851 |
F | -211.1121 |
G | 290.5365 |
H | -193.8774 |
Reference | Chase, 1998 |
Comment | Data last reviewed in December, 1975 |

Gas phase ion energetics data

Data compiled as indicated in comments:
LBLHLM - Sharon G. Lias, John E. Bartmess, Joel F. Liebman, John L. Holmes, Rhoda D. Levin, and W. Gary Mallard
LLK - Sharon G. Lias, Rhoda D. Levin, and Sherif A. Kafafi
RDSH - Henry M. Rosenstock, Keith Draxl, Bruce W. Steiner, and John T. Herron
Ionization energy determinations
IE (eV) | Method | Reference | Comment |
---|---|---|---|
6. ± 1. | EI | Farber, Srivastava, et al., 1987 | LBLHLM |
5.6 ± 0.2 | DER | Murad, 1983 | LBLHLM |
5.6 ± 0.2 | EI | Murad, 1981 | LLK |
5.9 ± 0.1 | DER | Kelly and Padley, 1970 | RDSH |

References

Chase, 1998
Chase, M.W., Jr.,
NIST-JANAF Themochemical Tables, Fourth Edition,
J. Phys. Chem. Ref. Data, Monograph 9, 1998, 1-1951. [all data]
Farber, Srivastava, et al., 1987
Farber, M.; Srivastava, R.D.; Moyer, J.W.; Leeper, J.D.,
Effusion mass spectrometric determination of thermodynamic properties of the gaseous mono- and di-hydroxides of calcium and KCaO(g),
J. Chem. Soc. Faraday Trans. 2, 1987, 83, 3229. [all data]
Murad, 1983
Murad, E.,
Abstraction reactions of Ca+ and Sr+ ions,
J. Chem. Phys., 1983, 78, 6611. [all data]
Murad, 1981
Murad, E.,
Thermochemical properties of the gaseous alkaline earth monohydroxides,
J. Chem. Phys., 1981, 75, 4080. [all data]
Kelly and Padley, 1970
Kelly, R.; Padley, P.J.,
Ionization potentials of alkaline-earth monohydroxides,
Chem. Commun., 1970, 1606. [all data]