Tetratungsten dodecaoxide
- Formula: O12W4
- Molecular weight: 927.35
- CAS Registry Number: 12165-45-6

Gas phase thermochemistry data

Quantity | Value | Units | Method | Reference | Comment |
---|---|---|---|---|---|
ΔfH°gas | -2804.12 | kJ/mol | Review | Chase, 1998 | Data last reviewed in September, 1966 |
Quantity | Value | Units | Method | Reference | Comment |
S°gas,1 bar | 604.86 | J/mol*K | Review | Chase, 1998 | Data last reviewed in September, 1966 |
Gas Phase Heat Capacity (Shomate Equation)
Cp° = A + B*t + C*t2 + D*t3 +
E/t2
H° − H°298.15= A*t + B*t2/2 +
C*t3/3 + D*t4/4 − E/t + F − H
S° = A*ln(t) + B*t + C*t2/2 + D*t3/3 −
E/(2*t2) + G
Cp = heat capacity (J/mol*K)
H° = standard enthalpy (kJ/mol)
S° = standard entropy (J/mol*K)
t = temperature (K) / 1000.
View plot Requires a JavaScript / HTML 5 canvas capable browser.
Temperature (K) | 298. to 6000. |
---|---|
A | 368.3400 |
B | 12.11880 |
C | -3.303880 |
D | 0.283403 |
E | -5.758100 |
F | -2933.870 |
G | 1014.750 |
H | -2804.120 |
Reference | Chase, 1998 |
Comment | Data last reviewed in September, 1966 |

Gas phase ion energetics data

Data compiled as indicated in comments:
LLK - Sharon G. Lias, Rhoda D. Levin, and Sherif A. Kafafi
Ionization energy determinations
IE (eV) | Method | Reference | Comment |
---|---|---|---|
12.0 ± 0.2 | EI | Bennett, Lin, et al., 1974 | LLK |
Appearance energy determinations
Ion | AE (eV) | Other Products | Method | Reference | Comment |
---|---|---|---|---|---|
O11W4+ | 13.9 ± 0.2 | O | EI | Bennett, Lin, et al., 1974 | LLK |

References

Chase, 1998
Chase, M.W., Jr.,
NIST-JANAF Themochemical Tables, Fourth Edition,
J. Phys. Chem. Ref. Data, Monograph 9, 1998, 1-1951. [all data]
Bennett, Lin, et al., 1974
Bennett, S.L.; Lin, S.-S.; Gilles, P.W.,
High-temperature vaporization of ternary systems. I. Mass spectrometry of oxygen-rich vanadium-tungsten-oxygen species,
J. Phys. Chem., 1974, 78, 266. [all data]