Ditungsten hexaoxide
- Formula: O6W2
- Molecular weight: 463.68
- CAS Registry Number: 12165-16-1

Gas phase thermochemistry data

Quantity | Value | Units | Method | Reference | Comment |
---|---|---|---|---|---|
ΔfH°gas | -1163.99 | kJ/mol | Review | Chase, 1998 | Data last reviewed in September, 1966 |
Quantity | Value | Units | Method | Reference | Comment |
S°gas,1 bar | 415.49 | J/mol*K | Review | Chase, 1998 | Data last reviewed in September, 1966 |
Gas Phase Heat Capacity (Shomate Equation)
Cp° = A + B*t + C*t2 + D*t3 +
E/t2
H° − H°298.15= A*t + B*t2/2 +
C*t3/3 + D*t4/4 − E/t + F − H
S° = A*ln(t) + B*t + C*t2/2 + D*t3/3 −
E/(2*t2) + G
Cp = heat capacity (J/mol*K)
H° = standard enthalpy (kJ/mol)
S° = standard entropy (J/mol*K)
t = temperature (K) / 1000.
View plot Requires a JavaScript / HTML 5 canvas capable browser.
Temperature (K) | 298. to 6000. |
---|---|
A | 179.7492 |
B | 2.692744 |
C | -0.727978 |
D | 0.062033 |
E | -2.430286 |
F | -1225.845 |
G | 618.5709 |
H | -1163.989 |
Reference | Chase, 1998 |
Comment | Data last reviewed in September, 1966 |

Gas phase ion energetics data

Data compiled as indicated in comments:
LLK - Sharon G. Lias, Rhoda D. Levin, and Sherif A. Kafafi
RDSH - Henry M. Rosenstock, Keith Draxl, Bruce W. Steiner, and John T. Herron
Ionization energy determinations
IE (eV) | Method | Reference | Comment |
---|---|---|---|
12.2 ± 0.2 | EI | Bennett, Lin, et al., 1974 | LLK |
13.4 | EI | Norman and Staley, 1965 | RDSH |
Appearance energy determinations
Ion | AE (eV) | Other Products | Method | Reference | Comment |
---|---|---|---|---|---|
O3W2+ | 35. ± 1. | ? | EI | Bennett, Lin, et al., 1974 | LLK |
O4W2+ | 17.1 ± 0.2 | ? | EI | Bennett, Lin, et al., 1974 | LLK |
O5W2+ | 15.3 ± 0.2 | O | EI | Bennett, Lin, et al., 1974 | LLK |
W2O5+ | 15.8 | O | EI | Norman and Staley, 1965 | RDSH |

References

Chase, 1998
Chase, M.W., Jr.,
NIST-JANAF Themochemical Tables, Fourth Edition,
J. Phys. Chem. Ref. Data, Monograph 9, 1998, 1-1951. [all data]
Bennett, Lin, et al., 1974
Bennett, S.L.; Lin, S.-S.; Gilles, P.W.,
High-temperature vaporization of ternary systems. I. Mass spectrometry of oxygen-rich vanadium-tungsten-oxygen species,
J. Phys. Chem., 1974, 78, 266. [all data]
Norman and Staley, 1965
Norman, J.H.; Staley, H.G.,
Thermodynamics of the dimerization and trimerization of gaseous tungsten trioxide and molybdenum trioxide,
J. Chem. Phys., 1965, 43, 3804. [all data]