Digalllium monoselenide

Gas phase ion energetics data

Data compiled by: Henry M. Rosenstock, Keith Draxl, Bruce W. Steiner, and John T. Herron

Ionization energy determinations

IE (eV) Method Reference
7.4 ± 0.3EIUy, Muenow, et al., 1968

Appearance energy determinations

Ion AE (eV) Other Products MethodReferenceComment
Ga+8.4 ± 0.5?EIUy, Muenow, et al., 1968
GaSe+11.2 ± 0.3GaEIUy, Muenow, et al., 1968
Ga2+10.8 ± 0.5SeEIUy, Muenow, et al., 1968
Se+15.6 ± 0.5?EIUy, Muenow, et al., 1968

References

Uy, Muenow, et al., 1968
Uy, O.M.; Muenow, D.W.; Ficalora, P.J.; Margrave, J.L., Mass spectrometric studies at high temperatures. Part 30. Vaporization of Ga2S3, Ga2Se3 and Ga2Te3, and stabilities of the gaseous gallium chalcogenides, J. Chem. Soc. Faraday Trans., 1968, 64, 2998. [all data]