Acetophenonechromium tricarbonyl
- Formula: C11H8CrO4
- Molecular weight: 256.1749
- CAS Registry Number: 12153-11-6

Gas phase thermochemistry data

Data compiled by: José A. Martinho Simões
Quantity | Value | Units | Method | Reference | Comment |
---|---|---|---|---|---|
ΔfH°gas | -478. ± 13. | kJ/mol | Review | Martinho Simões | The value given for the enthalpy of formation was recommended in Al-Takhin, Connor, et al., 1984 |

Condensed phase thermochemistry data

Data compiled by: José A. Martinho Simões
Quantity | Value | Units | Method | Reference | Comment |
---|---|---|---|---|---|
ΔfH°solid | -585. ± 13. | kJ/mol | Review | Martinho Simões | The value given for the enthalpy of formation was recommended in Al-Takhin, Connor, et al., 1984 |

Gas phase ion energetics data

Data compiled by: Henry M. Rosenstock, Keith Draxl, Bruce W. Steiner, and John T. Herron
Ionization energy determinations
IE (eV) | Method | Reference |
---|---|---|
7.44 | EI | Muller, 1969 |

Phase change data

Data compiled as indicated in comments:
MS - José A. Martinho Simões
AC - William E. Acree, Jr., James S. Chickos

Quantity Value Units Method Reference Comment
Δsub107.0 ± 0.6kJ/molTD-HFC, HAL-HFCAl-Takhin, Connor, et al., 1984MS
Δsub107.0 ± 0.6kJ/molCAl-Takhin, Connor, et al., 1984, 2AC

References

Martinho Simões
Martinho Simões, J.A.,
Private communication (see http://webbook.nist.gov/chemistry/om/). [all data]
Al-Takhin, Connor, et al., 1984
Al-Takhin, G.; Connor, J.A.; Skinner, H.A.; Zaharani-Moettar, M.T.,
J. Organomet. Chem., 1984, 260, 189. [all data]
Muller, 1969
Muller, J.,
Ionisierungspotentiale von substituierten Benzolchrom-tricarbonyl-Komplexen,
J. Organometal. Chem., 1969, 18, 321. [all data]