Chromium,[(2,3,5,6-η)-bicyclo[2.2.1]hepta-2,5-diene]tetracarbonyl-
- Formula: C11H8CrO4
- Molecular weight: 256.1749
- IUPAC Standard InChIKey: AHJNXOJJUVDRBD-UHFFFAOYSA-N
- CAS Registry Number: 12146-36-0
- Chemical structure:

Gas phase thermochemistry data

Data compiled by: José A. Martinho Simões
Quantity | Value | Units | Method | Reference | Comment |
---|---|---|---|---|---|
ΔfH°gas | -307. ± 10. | kJ/mol | Review | Martinho Simões |

Condensed phase thermochemistry data

Data compiled by: José A. Martinho Simões
Quantity | Value | Units | Method | Reference | Comment |
---|---|---|---|---|---|
ΔfH°solid | -396.0 ± 9.4 | kJ/mol | Review | Martinho Simões |

Phase change data

Data compiled as indicated in comments:
AC - William E. Acree, Jr., James S. Chickos
MS - José A. Martinho Simões
Quantity | Value | Units | Method | Reference | Comment |
---|---|---|---|---|---|
ΔsubH° | 89.0 ± 4.0 | kJ/mol | N/A | Pilcher and Skinner, 1983 | See also Brown, Connor, et al., 1977.; AC |
ΔsubH° | 89.0 ± 4.0 | kJ/mol | HAL-HFC | Brown, Connor, et al., 1977, 2 | MS |

Gas phase ion energetics data

Data compiled by: Sharon G. Lias, Rhoda D. Levin, and Sherif A. Kafafi
Ionization energy determinations
IE (eV) | Method | Reference | Comment |
---|---|---|---|
7.28 | PE | Worley and Webb, 1980 | Vertical value |

References

Martinho Simões
Martinho Simões, J.A.,
Private communication (see http://webbook.nist.gov/chemistry/om/). [all data]
Pilcher and Skinner, 1983
Pilcher, G.; Skinner, H.A.,
Thermochemistry of organometallic compounds, 1983, 43-90, https://doi.org/10.1002/9780470771686.ch2
. [all data]
Brown, Connor, et al., 1977
Brown, D.L.S.; Connor, Joseph A.; Demain, Christopher P.; Leung, May L.; Martinho-Simoes, Jose A.; Skinner, Henry A.; Zafarani Moattar, Mohamed T.,
The thermochemistry of carbonyl complexes of Cr, Mo, Wand Co with arenes, cycloheptatriene, and norbornadiene,
Journal of Organometallic Chemistry, 1977, 142, 3, 321-335, https://doi.org/10.1016/S0022-328X(00)88348-5
. [all data]
Brown, Connor, et al., 1977, 2
Brown, D.L.S.; Connor, J.A.; Demain, C.P.; Leung, M.L.; Martinho Simões, J.A.; Skinner, H.A.; Zafarani- Moattar, M.T.,
J. Organometal. Chem., 1977, 142, 321. [all data]
Worley and Webb, 1980
Worley, S.D.; Webb, T.R.,
The electronic structure of transition-metal carbonyl complexes of norbornadiene and mesitylene,
J. Organomet. Chem., 1980, 192, 139. [all data]