Diyttrium monoxide
- Formula: OY2
- Molecular weight: 193.8111
- CAS Registry Number: 12143-14-5

Gas phase ion energetics data

Data compiled by: Sharon G. Lias and Joel F. Liebman
Ionization energy determinations
IE (eV) | Method | Reference | Comment |
---|---|---|---|
6.0 | PI | Knickelbein, 1995 | Vertical value |

References

Knickelbein, 1995
Knickelbein, M.,
Photoionization spectroscopy of yttrium clusters: Ionization potentials for Yn and YnO (n=2-31),
J. Chem. Phys., 1995, 102, 1. [all data]