Lanthanum, compound with rhodium(1:1)
- Formula: LaRh
- Molecular weight: 241.81097
- IUPAC Standard InChIKey: PUBBRJWVQNPPQB-UHFFFAOYSA-N
- CAS Registry Number: 12142-68-6
- Chemical structure:
View 3d structure (requires JavaScript / HTML 5) - Permanent link for this species. Use this link for bookmarking this species for future reference.

Gas phase ion energetics data

Data compiled by: Sharon G. Lias, Rhoda D. Levin, and Sherif A. Kafafi
Ionization energy determinations
IE (eV) | Method | Reference |
---|---|---|
7.7 ± 1.0 | EI | Cocke, Gingerich, et al., 1973 |

References

Cocke, Gingerich, et al., 1973
Cocke, D.L.; Gingerich, K.A.; Kordis, J.,
Determination of the high bond dissociation energy of the molecule LaRh,
High Temp. Sci., 1973, 5, 474. [all data]