Strontium monohydroxide
- Formula: HOSr
- Molecular weight: 104.63
- IUPAC Standard InChIKey: HGDJQLJUGUXYKQ-UHFFFAOYSA-M
- CAS Registry Number: 12141-14-9
- Chemical structure:
View 3d structure (requires JavaScript / HTML 5) - Permanent link for this species. Use this link for bookmarking this species for future reference.

Gas phase thermochemistry data

Quantity | Value | Units | Method | Reference | Comment |
---|---|---|---|---|---|
ΔfH°gas | -205.52 | kJ/mol | Review | Chase, 1998 | Data last reviewed in December, 1975 |
Quantity | Value | Units | Method | Reference | Comment |
S°gas,1 bar | 246.46 | J/mol*K | Review | Chase, 1998 | Data last reviewed in December, 1975 |
Gas Phase Heat Capacity (Shomate Equation)
Cp° = A + B*t + C*t2 + D*t3 +
E/t2
H° − H°298.15= A*t + B*t2/2 +
C*t3/3 + D*t4/4 − E/t + F − H
S° = A*ln(t) + B*t + C*t2/2 + D*t3/3 −
E/(2*t2) + G
Cp = heat capacity (J/mol*K)
H° = standard enthalpy (kJ/mol)
S° = standard entropy (J/mol*K)
t = temperature (K) / 1000.
View plot Requires a JavaScript / HTML 5 canvas capable browser.
Temperature (K) | 298. to 6000. |
---|---|
A | 50.86405 |
B | 4.610935 |
C | -0.435638 |
D | 0.031291 |
E | -0.562673 |
F | -222.7800 |
G | 303.4915 |
H | -205.5181 |
Reference | Chase, 1998 |
Comment | Data last reviewed in December, 1975 |

Gas phase ion energetics data

Data evaluated as indicated in comments:
HL - Edward P. Hunter and Sharon G. Lias
Data compiled as indicated in comments:
LBLHLM - Sharon G. Lias, John E. Bartmess, Joel F. Liebman, John L. Holmes, Rhoda D. Levin, and W. Gary Mallard
LLK - Sharon G. Lias, Rhoda D. Levin, and Sherif A. Kafafi
RDSH - Henry M. Rosenstock, Keith Draxl, Bruce W. Steiner, and John T. Herron
Quantity | Value | Units | Method | Reference | Comment |
---|---|---|---|---|---|
Proton affinity (review) | 1019.4 | kJ/mol | N/A | Hunter and Lias, 1998 | HL |
Quantity | Value | Units | Method | Reference | Comment |
Gas basicity | 981.6 | kJ/mol | N/A | Hunter and Lias, 1998 | HL |
Ionization energy determinations
IE (eV) | Method | Reference | Comment |
---|---|---|---|
5.1 ± 0.2 | EI | Murad, 1983 | LBLHLM |
5.1 ± 0.2 | EI | Murad, 1981 | LLK |
5.6 ± 0.1 | DER | Kelly and Padley, 1970 | RDSH |

References

Chase, 1998
Chase, M.W., Jr.,
NIST-JANAF Themochemical Tables, Fourth Edition,
J. Phys. Chem. Ref. Data, Monograph 9, 1998, 1-1951. [all data]
Hunter and Lias, 1998
Hunter, E.P.; Lias, S.G.,
Evaluated Gas Phase Basicities and Proton Affinities of Molecules: An Update,
J. Phys. Chem. Ref. Data, 1998, 27, 3, 413-656, https://doi.org/10.1063/1.556018
. [all data]
Murad, 1983
Murad, E.,
Abstraction reactions of Ca+ and Sr+ ions,
J. Chem. Phys., 1983, 78, 6611. [all data]
Murad, 1981
Murad, E.,
Thermochemical properties of the gaseous alkaline earth monohydroxides,
J. Chem. Phys., 1981, 75, 4080. [all data]
Kelly and Padley, 1970
Kelly, R.; Padley, P.J.,
Ionization potentials of alkaline-earth monohydroxides,
Chem. Commun., 1970, 1606. [all data]