Magnesium monohydroxide
- Formula: HMgO
- Molecular weight: 41.3123
- IUPAC Standard InChIKey: UNYOJUYSNFGNDV-UHFFFAOYSA-M
- CAS Registry Number: 12141-11-6
- Chemical structure:
View 3d structure (requires JavaScript / HTML 5) - Permanent link for this species. Use this link for bookmarking this species for future reference.

Gas phase thermochemistry data

Quantity | Value | Units | Method | Reference | Comment |
---|---|---|---|---|---|
ΔfH°gas | -164.76 | kJ/mol | Review | Chase, 1998 | Data last reviewed in December, 1975 |
Quantity | Value | Units | Method | Reference | Comment |
S°gas,1 bar | 226.44 | J/mol*K | Review | Chase, 1998 | Data last reviewed in December, 1975 |
Gas Phase Heat Capacity (Shomate Equation)
Cp° = A + B*t + C*t2 + D*t3 +
E/t2
H° − H°298.15= A*t + B*t2/2 +
C*t3/3 + D*t4/4 − E/t + F − H
S° = A*ln(t) + B*t + C*t2/2 + D*t3/3 −
E/(2*t2) + G
Cp = heat capacity (J/mol*K)
H° = standard enthalpy (kJ/mol)
S° = standard entropy (J/mol*K)
t = temperature (K) / 1000.
View plot Requires a JavaScript / HTML 5 canvas capable browser.
Temperature (K) | 298. to 6000. |
---|---|
A | 47.86747 |
B | 8.461889 |
C | -1.842082 |
D | 0.142410 |
E | -0.643625 |
F | -181.5492 |
G | 278.3038 |
H | -164.7550 |
Reference | Chase, 1998 |
Comment | Data last reviewed in December, 1975 |

Gas phase ion energetics data

Data compiled as indicated in comments:
LLK - Sharon G. Lias, Rhoda D. Levin, and Sherif A. Kafafi
Ionization energy determinations
IE (eV) | Method | Reference | Comment |
---|---|---|---|
7.5 ± 0.3 | EI | Murad, 1981 | LLK |

References

Chase, 1998
Chase, M.W., Jr.,
NIST-JANAF Themochemical Tables, Fourth Edition,
J. Phys. Chem. Ref. Data, Monograph 9, 1998, 1-1951. [all data]
Murad, 1981
Murad, E.,
Thermochemical properties of the gaseous alkaline earth monohydroxides,
J. Chem. Phys., 1981, 75, 4080. [all data]