Rhodium monoxide
- Formula: ORh
- Molecular weight: 118.9049
- IUPAC Standard InChIKey: JABLCXRGZQQDDV-UHFFFAOYSA-N
- CAS Registry Number: 12137-18-7
- Chemical structure:
View 3d structure (requires JavaScript / HTML 5) - Permanent link for this species. Use this link for bookmarking this species for future reference.

Gas phase ion energetics data

Data compiled as indicated in comments:
LL - Sharon G. Lias and Joel F. Liebman
RDSH - Henry M. Rosenstock, Keith Draxl, Bruce W. Steiner, and John T. Herron
Ionization energy determinations
IE (eV) | Method | Reference | Comment |
---|---|---|---|
8.63 ± 0.43 | END/DER | Chen and Armentrout, 1995 | LL |
9.3 | EI | Norman, Staley, et al., 1964 | RDSH |

References

Chen and Armentrout, 1995
Chen, Y.-M.; Armentrout, P.B.,
Kinetic energy dependence of the reactions of Ru+, Rh+, Pd+, and Ag+ with O2,
J. Chem. Phys., 1995, 103, 618. [all data]
Norman, Staley, et al., 1964
Norman, J.H.; Staley, H.G.; Bell, W.E.,
Mass spectrometric study of gaseous oxides of rhodium and palladium,
J. Phys. Chem., 1964, 68, 662. [all data]