Cyclopentadienyl(isocyanocyclohexane)manganese dicarbonyl
- Formula: C14H16MnNO2
- Molecular weight: 285.2204
- IUPAC Standard InChIKey: GUIPAWRKEMUKEG-UHFFFAOYSA-N
- CAS Registry Number: 12131-21-4
- Chemical structure:
View 3d structure (requires JavaScript / HTML 5) - Permanent link for this species. Use this link for bookmarking this species for future reference.

Gas phase ion energetics data

Data compiled by: Henry M. Rosenstock, Keith Draxl, Bruce W. Steiner, and John T. Herron
Ionization energy determinations
IE (eV) | Method | Reference |
---|---|---|
7.0 ± 0.1 | EI | Muller and Herberhold, 1968 |
Appearance energy determinations
Ion | AE (eV) | Other Products | Method | Reference | Comment |
---|---|---|---|---|---|
C12H16NMn+ | 7.8 ± 0.1 | 2CO | EI | Muller and Herberhold, 1968 |

References

Muller and Herberhold, 1968
Muller, J.; Herberhold, M.,
Massenspektroskopische Untersuchungen an C5H5Mn(CO)3 und C5H5Mn(CO)2 L-Komplexen,
J. Organometal. Chem., 1968, 13, 399. [all data]