Bis(benzene)vanadium
- Formula: C12H12V
- Molecular weight: 207.1652
- IUPAC Standard InChIKey: YWTIBPUNCKNKNA-UHFFFAOYSA-N
- CAS Registry Number: 12129-72-5
- Chemical structure:

Condensed phase thermochemistry data

Data compiled by: José A. Martinho Simões
Quantity | Value | Units | Method | Reference | Comment |
---|---|---|---|---|---|
ΔfH°solid | 8.8 ± 3.7 | kcal/mol | Review | Martinho Simões | |
Quantity | Value | Units | Method | Reference | Comment |
ΔcH°solid | -1732.7 ± 3.6 | kcal/mol | CC-SB | Fischer and Reckziegel, 1961 | Please also see Pedley and Rylance, 1977, Cox and Pilcher, 1970, and Tel'noi and Rabinovich, 1977. |

Phase change data

Data compiled by: José A. Martinho Simões
Quantity | Value | Units | Method | Reference | Comment |
---|---|---|---|---|---|
ΔsubH° | 17. ± 2.4 | kcal/mol | CC-SB | Pilcher and Skinner, 1982 |

Gas phase ion energetics data

Data compiled by: Henry M. Rosenstock, Keith Draxl, Bruce W. Steiner, and John T. Herron
Ionization energy determinations
IE (eV) | Method | Reference |
---|---|---|
6.3 ± 0.1 | EI | Muller and Goser, 1968 |
Appearance energy determinations
Ion | AE (eV) | Other Products | Method | Reference | Comment |
---|---|---|---|---|---|
C6H6V+ | 10.5 ± 0.2 | C6H6 | EI | Muller and Goser, 1968 | |
V+ | 13.6 ± 0.3 | ? | EI | Muller and Goser, 1968 |

Gas phase thermochemistry data

Data compiled by: José A. Martinho Simões
Quantity | Value | Units | Method | Reference | Comment |
---|---|---|---|---|---|
ΔfH°gas | 25.6 ± 4.4 | kcal/mol | Review | Martinho Simões |

References

Martinho Simões
Martinho Simões, J.A.,
Private communication (see http://webbook.nist.gov/chemistry/om/). [all data]
Fischer and Reckziegel, 1961
Fischer, E.O.; Reckziegel, A.,
Chem. Ber., 1961, 94, 2204. [all data]
Pedley and Rylance, 1977
Pedley, J.B.; Rylance, J.,
Computer Analysed Thermochemical Data: Organic and Organometallic Compounds, University of Sussex, Brigton, 1977. [all data]
Cox and Pilcher, 1970
Cox, J.D.; Pilcher, G.,
Thermochemistry of Organic and Organometallic Compounds
in Academic Press, New York, 1970. [all data]
Tel'noi and Rabinovich, 1977
Tel'noi, V.I.; Rabinovich, I.B.,
Russ. Chem. Rev., 1977, 46, 689. [all data]
Pilcher and Skinner, 1982
Pilcher, G.; Skinner, H.A.,
In The Chemistry of the Metal-Carbon Bond Wiley: New York, Hartley, F. R.; Patai, S., ed(s)., 1982. [all data]
Muller and Goser, 1968
Muller, J.; Goser, P.,
Massenspektroskopische Untersuchungen an Ubergangsmetall-π-Komplexen mit funf-, sechs- und siebengliedrigen aromatischen Ringliganden,
J. Organometal. Chem., 1968, 12, 163. [all data]