Tungsten, tricarbonyl[(1,2,3,4,5,6-η)-1,3,5-trimethylbenzene]-
- Formula: C12H12O3W
- Molecular weight: 388.06
- IUPAC Standard InChIKey: OENLQXWEAUYNBC-UHFFFAOYSA-N
- CAS Registry Number: 12129-69-0
- Chemical structure:

Gas phase thermochemistry data

Data compiled by: José A. Martinho Simões
Quantity | Value | Units | Method | Reference | Comment |
---|---|---|---|---|---|
ΔfH°gas | -366.2 ± 7.0 | kJ/mol | Review | Martinho Simões |

Condensed phase thermochemistry data

Data compiled by: José A. Martinho Simões
Quantity | Value | Units | Method | Reference | Comment |
---|---|---|---|---|---|
ΔfH°solid | -477.2 ± 3.6 | kJ/mol | Review | Martinho Simões |

Phase change data

Data compiled by: José A. Martinho Simões
Quantity | Value | Units | Method | Reference | Comment |
---|---|---|---|---|---|
ΔsubH° | 111.0 ± 6.0 | kJ/mol | HAL-HFC | Brown, Connor, et al., 1977 |

Gas phase ion energetics data

Data compiled as indicated in comments:
LBLHLM - Sharon G. Lias, John E. Bartmess, Joel F. Liebman, John L. Holmes, Rhoda D. Levin, and W. Gary Mallard
LLK - Sharon G. Lias, Rhoda D. Levin, and Sherif A. Kafafi
Ionization energy determinations
IE (eV) | Method | Reference | Comment |
---|---|---|---|
7.0 | PE | Byers and Hall, 1987 | LBLHLM |
7.20 ± 0.05 | PE | Gower, Kane-Maguire, et al., 1977 | Vertical value; LLK |

References

Martinho Simões
Martinho Simões, J.A.,
Private communication (see http://webbook.nist.gov/chemistry/om/). [all data]
Brown, Connor, et al., 1977
Brown, D.L.S.; Connor, J.A.; Demain, C.P.; Leung, M.L.; Martinho Simões, J.A.; Skinner, H.A.; Zafarani- Moattar, M.T.,
J. Organometal. Chem., 1977, 142, 321. [all data]
Byers and Hall, 1987
Byers, B.P.; Hall, M.B.,
Comparison of isolobal fragments: Photoelectron spectra and molecular orbital calculations of (arene)tricarbonylchromium, molybdenum, and tungsten complexes,
Organometallics, 1987, 6, 2319. [all data]
Gower, Kane-Maguire, et al., 1977
Gower, M.; Kane-Maguire, L.A.P.; Maier, J.P.; Sweigart, D.A.,
Ultraviolet photoelectron spectra of cyclohepta-1,3,5-triene and mesitylene tricarbonyl complexes of the group 6A metals,
J. Chem. Soc. Dalton Trans., 1977, 316. [all data]