Molybdenum,bis(η-benzene)-
- Formula: C12H12Mo
- Molecular weight: 252.18
- IUPAC Standard InChIKey: KXKURNTZDRVLAJ-UHFFFAOYSA-N
- CAS Registry Number: 12129-68-9
- Chemical structure:

Phase change data

Data compiled by: José A. Martinho Simões
Quantity | Value | Units | Method | Reference | Comment |
---|---|---|---|---|---|
ΔsubH° | 94.6 ± 8.4 | kJ/mol | CC-SB | Fischer and Reckziegel, 1961 |

Gas phase ion energetics data

Data compiled as indicated in comments:
LLK - Sharon G. Lias, Rhoda D. Levin, and Sherif A. Kafafi
Ionization energy determinations
IE (eV) | Method | Reference | Comment |
---|---|---|---|
5.52 ± 0.05 | PE | Evans, Green, et al., 1974 | Vertical value; LLK |

Condensed phase thermochemistry data

Data compiled by: José A. Martinho Simões
Quantity | Value | Units | Method | Reference | Comment |
---|---|---|---|---|---|
ΔfH°solid | 73.3 ± 4.4 | kcal/mol | Review | Martinho Simões | |
ΔfH°solid | 56.2 ± 1.9 | kcal/mol | Review | Martinho Simões | |
ΔfH°solid | 56.5 ± 1.7 | kcal/mol | Review | Martinho Simões | |
ΔfH°solid | 56.3 ± 1.3 | kcal/mol | Review | Martinho Simões | Selected data. Average of the values from Connor, El-Saied, et al., 1981. |
Quantity | Value | Units | Method | Reference | Comment |
ΔcH°solid | -1789.8 ± 4.4 | kcal/mol | CC-SB | Fischer and Reckziegel, 1961 | Please also see Pedley and Rylance, 1977, Cox and Pilcher, 1970, and Tel'noi and Rabinovich, 1977. |

Gas phase thermochemistry data

Data compiled by: José A. Martinho Simões

Quantity Value Units Method Reference Comment
Δfgas401. ± 20.kJ/molReviewMartinho Simões
Δfgas330. ± 12.kJ/molReviewMartinho Simões
Δfgas331. ± 11.kJ/molReviewMartinho Simões
Δfgas330. ± 10.kJ/molReviewMartinho SimõesSelected data. Average of the values from Connor, El-Saied, et al., 1981.

References

Fischer and Reckziegel, 1961
Fischer, E.O.; Reckziegel, A.,
Chem. Ber., 1961, 94, 2204. [all data]
Evans, Green, et al., 1974
Evans, S.; Green, J.C.; Jackson, S.E.; Higginson, B.,
He(I) photoelectron spectra of some transition-metal sandwich complexes,
J. Chem. Soc. Dalton Trans., 1974, 304. [all data]