Titanium, dicarbonylbis(η5-2,4-cyclopentadien-1-yl)-
- Formula: C12H10O2Ti
- Molecular weight: 234.074
- IUPAC Standard InChIKey: PGTLZCOZZVJMOQ-UHFFFAOYSA-N
- CAS Registry Number: 12129-51-0
- Chemical structure:

Phase change data

Data compiled as indicated in comments:
MS - José A. Martinho Simões
AC - William E. Acree, Jr., James S. Chickos
Quantity | Value | Units | Method | Reference | Comment |
---|---|---|---|---|---|
ΔsubH° | 84.2 ± 3.5 | kJ/mol | RSC | Dias, Dias, et al., 1987 | MS |
ΔsubH° | 84.2 ± 3.5 | kJ/mol | ME | Dias, Dias, et al., 1987, 2 | AC |

Reaction thermochemistry data

Data compiled by: José A. Martinho Simões
Individual Reactions
(cr) +
(cr) = C10H10I2Ti (cr) + 2
(g)
By formula: C12H10O2Ti (cr) + I2 (cr) = C10H10I2Ti (cr) + 2CO (g)
Quantity | Value | Units | Method | Reference | Comment |
---|---|---|---|---|---|
ΔrH° | -74.1 ± 2.1 | kJ/mol | RSC | Dias, Dias, et al., 1987 |

Gas phase ion energetics data

Data compiled as indicated in comments:
LBLHLM - Sharon G. Lias, John E. Bartmess, Joel F. Liebman, John L. Holmes, Rhoda D. Levin, and W. Gary Mallard
LLK - Sharon G. Lias, Rhoda D. Levin, and Sherif A. Kafafi
Ionization energy determinations
IE (eV) | Method | Reference | Comment |
---|---|---|---|
6.62 | PE | Bohm, 1982 | Vertical value; LBLHLM |
6.35 | PE | Fragala, Ciliberto, et al., 1979 | Vertical value; LLK |

References

Dias, Dias, et al., 1987
Dias, A.R.; Dias, P.B.; Diogo, H.P.; Galvão, A.M.; Minas da Piedade, M.E.; Martinho Simões, J.A.,
Organometallics, 1987, 6, 1427. [all data]
Dias, Dias, et al., 1987, 2
Dias, Alberto R.; Dias, Palmira B.; Diogo, Herminio P.; Galvao, Adelino M.; Minas da Piedade, Manuel E.; Simoes, Jose A. Martinho.,
Energetics of molybdenum-azobenzene, titanium-azobenzene, titanium-iodide, and titanium-carbonyl bonds in bis(cyclopentadienyl) complexes,
Organometallics, 1987, 6, 7, 1427-1432, https://doi.org/10.1021/om00150a011
. [all data]
Bohm, 1982
Bohm, M.C.,
The photoelectron spectra of bis(cyclopentadienyl)titanium derivatives - a green's function approach,
Inorg. Chim. Acta, 1982, 62, 171. [all data]
Fragala, Ciliberto, et al., 1979
Fragala, I.; Ciliberto, E.; Thomas, J.L.,
He(I) and He(II) excited photoelectron spectra of cyclopentadienyldicarbonyltitanium(II),
J. Organomet. Chem., 1979, 175, 25. [all data]