(η6-Methylbenzoate) chromium tricarbonyl
- Formula: C11H8CrO5
- Molecular weight: 272.1743
- CAS Registry Number: 12125-87-0

Gas phase thermochemistry data

Data compiled by: José A. Martinho Simões
Quantity | Value | Units | Method | Reference | Comment |
---|---|---|---|---|---|
ΔfH°gas | -620.1 ± 9.3 | kJ/mol | Review | Martinho Simões | |
ΔfH°gas | -658.5 ± 9.8 | kJ/mol | Review | Martinho Simões |

Condensed phase thermochemistry data

Data compiled by: José A. Martinho Simões
Quantity | Value | Units | Method | Reference | Comment |
---|---|---|---|---|---|
ΔfH°solid | -733.6 ± 7.9 | kJ/mol | Review | Martinho Simões | |
ΔfH°solid | -772.0 ± 8.4 | kJ/mol | Review | Martinho Simões |

Gas phase ion energetics data

Data compiled as indicated in comments:
LLK - Sharon G. Lias, Rhoda D. Levin, and Sherif A. Kafafi
RDSH - Henry M. Rosenstock, Keith Draxl, Bruce W. Steiner, and John T. Herron
Ionization energy determinations
IE (eV) | Method | Reference | Comment |
---|---|---|---|
7.1 | EI | Simonneaux, Jaouen, et al., 1977 | LLK |
7.0 ± 0.1 | EI | Gilbert, Leach, et al., 1973 | LLK |
7.41 | EI | Muller, 1969 | RDSH |
Appearance energy determinations
Ion | AE (eV) | Other Products | Method | Reference | Comment |
---|---|---|---|---|---|
C8H8O2Cr+ | 9.1 | 3CO | EI | Simonneaux, Jaouen, et al., 1977 | LLK |
C8H8O2Cr+ | 10.0 ± 0.1 | 3CO | EI | Gilbert, Leach, et al., 1973 | LLK |
C8H8O2+ | 9.3 ± 0.1 | ? | EI | Gilbert, Leach, et al., 1973 | LLK |
C9H8O3Cr+ | 7.7 | 2CO | EI | Simonneaux, Jaouen, et al., 1977 | LLK |
C9H8O3Cr+ | 8.3 ± 0.1 | 2CO | EI | Gilbert, Leach, et al., 1973 | LLK |
Cr+ | 14.0 ± 0.1 | ? | EI | Gilbert, Leach, et al., 1973 | LLK |

Phase change data

Data compiled as indicated in comments:
MS - José A. Martinho Simões
AC - William E. Acree, Jr., James S. Chickos
Quantity | Value | Units | Method | Reference | Comment |
---|---|---|---|---|---|
ΔsubH° | 27.1 ± 1.2 | kcal/mol | TD-HFC | Al-Takhin, Connor, et al., 1984 | MS |
ΔsubH° | 22.2 ± 0.48 | kcal/mol | C | Al-Takhin, Connor, et al., 1984, 2 | AC |
ΔsubH° | 27.2 ± 1.2 | kcal/mol | C | Al-Takhin, Connor, et al., 1984, 2 | AC |
ΔsubH° | 22.6 ± 1.0 | kcal/mol | N/A | Pilcher and Skinner, 1983 | See also Adedeji, Lalage, et al., 1975.; AC |

References

Martinho Simões
Martinho Simões, J.A.,
Private communication (see http://webbook.nist.gov/chemistry/om/). [all data]
Simonneaux, Jaouen, et al., 1977
Simonneaux, G.; Jaouen, G.; Dabard, R.; Guenot, P.,
Contribution a l'etude des metaux asymetriques IV. Etude des complexes areniques du chrome(o) par spectroscopie de masse: modes de liaison du metal avec divers ligands a deux electrons: phosphines, phosphites, carbonyle et thiocarbonyle,
J. Organomet. Chem., 1977, 132, 231. [all data]
Gilbert, Leach, et al., 1973
Gilbert, J.R.; Leach, W.P.; Miller, J.R.,
Ionisation appearance potential measurements in arene chromium tricarbonyls,
J. Organomet. Chem., 1973, 49, 219. [all data]
Muller, 1969
Muller, J.,
Ionisierungspotentiale von substituierten Benzolchrom-tricarbonyl-Komplexen,
J. Organometal. Chem., 1969, 18, 321. [all data]