Chromium, tricarbonyl[(1,2,3,4,5,6-η)-1,3,5-cycloheptatriene]-
- Formula: C10H8CrO3
- Molecular weight: 228.1648
- IUPAC Standard InChIKey: RTJMWZLRYSYOEK-UHFFFAOYSA-N
- CAS Registry Number: 12125-72-3
- Chemical structure:

Phase change data

Data compiled as indicated in comments:
MS - José A. Martinho Simões
AC - William E. Acree, Jr., James S. Chickos
Quantity | Value | Units | Method | Reference | Comment |
---|---|---|---|---|---|
ΔsubH° | 87.9 ± 4.0 | kJ/mol | HAL-HFC | Brown, Connor, et al., 1977 | Another value for the enthalpy of sublimation has been reported: 94.1 ± 4.2 kJ/mol Adedeji, Brown, et al., 1975; MS |
ΔsubH° | 94.1 | kJ/mol | C | Adedeji, Lalage, et al., 1975 | AC |

Gas phase ion energetics data

Data compiled as indicated in comments:
LLK - Sharon G. Lias, Rhoda D. Levin, and Sherif A. Kafafi
RDSH - Henry M. Rosenstock, Keith Draxl, Bruce W. Steiner, and John T. Herron
Ionization energy determinations
IE (eV) | Method | Reference | Comment |
---|---|---|---|
6.9 ± 0.2 | EI | Davis, Ojo, et al., 1978 | LLK |
7.10 | EI | Muller, 1969 | RDSH |
7.18 | PE | Fragala, Ciliberto, et al., 1979 | Vertical value; LLK |
7.30 ± 0.05 | PE | Gower, Kane-Maguire, et al., 1977 | Vertical value; LLK |
Appearance energy determinations
Ion | AE (eV) | Other Products | Method | Reference | Comment |
---|---|---|---|---|---|
C7H8Cr+ | 10.2 ± 0.2 | 3CO | EI | Davis, Ojo, et al., 1978 | LLK |
Cr+ | 13.3 ± 0.2 | C7H8+3CO | EI | Davis, Ojo, et al., 1978 | LLK |

Gas phase thermochemistry data

Data compiled by: José A. Martinho Simões
Quantity | Value | Units | Method | Reference | Comment |
---|---|---|---|---|---|
ΔfH°gas | -221.8 ± 9.6 | kJ/mol | Review | Martinho Simões |

Condensed phase thermochemistry data

Data compiled by: José A. Martinho Simões
Quantity | Value | Units | Method | Reference | Comment |
---|---|---|---|---|---|
ΔfH°solid | -309.7 ± 8.7 | kJ/mol | Review | Martinho Simões |

References

Brown, Connor, et al., 1977
Brown, D.L.S.; Connor, J.A.; Demain, C.P.; Leung, M.L.; Martinho Simões, J.A.; Skinner, H.A.; Zafarani- Moattar, M.T.,
J. Organometal. Chem., 1977, 142, 321. [all data]
Adedeji, Brown, et al., 1975
Adedeji, F.A.; Brown, D.L.S.; Connor, J.A.; Leung, M.; Paz-Andrade, I.M.; Skinner, H.A.,
J. Organometal. Chem., 1975, 97, 221. [all data]
Adedeji, Lalage, et al., 1975
Adedeji, Festus A.; Lalage, D.; Brown, S.; Connor, Joseph A.; Leung, May L.; Paz-Andrade, I. Maria; Skinner, Henry A.,
Thermochemistry of arene chromium tricarbonyls and the strenghts of arene-chromium bonds,
Journal of Organometallic Chemistry, 1975, 97, 2, 221-228, https://doi.org/10.1016/S0022-328X(00)89468-1
. [all data]
Davis, Ojo, et al., 1978
Davis, R.; Ojo, I.A.; Webb, M.L.,
Mass spectrometry of transition-metal π-complexes, V.-Fragmentation and structure of chromium-coordinated [C7H8]+ and [C8H10]+ ions,
Org. Mass Spectrom., 1978, 13, 547. [all data]
Muller, 1969
Muller, J.,
Ionisierungspotentiale von substituierten Benzolchrom-tricarbonyl-Komplexen,
J. Organometal. Chem., 1969, 18, 321. [all data]
Fragala, Ciliberto, et al., 1979
Fragala, I.; Ciliberto, E.; Granozzi, G.; Deganello, G.,
He-I and He-II excited photoelectron spectra of cycloheptatrienetricarbonyl complexes of group VIA metals,
J. Organomet. Chem., 1979, 182, 511. [all data]
Gower, Kane-Maguire, et al., 1977
Gower, M.; Kane-Maguire, L.A.P.; Maier, J.P.; Sweigart, D.A.,
Ultraviolet photoelectron spectra of cyclohepta-1,3,5-triene and mesitylene tricarbonyl complexes of the group 6A metals,
J. Chem. Soc. Dalton Trans., 1977, 316. [all data]