Ammonium Chloride
- Formula: ClH4N
- Molecular weight: 53.491
- IUPAC Standard InChIKey: NLXLAEXVIDQMFP-UHFFFAOYSA-N
- CAS Registry Number: 12125-02-9
- Chemical structure:
- Other names: (NH4)Cl; Ammonium chloride ((NH4)Cl); Amchlor; Ammoneric; Ammoniumchlorid; Ammonium muriate; Chlorid amonny; Darammon; SAL AMMONIA; SAL AMMONIAC; Salammonite; Salmiac; Ammonium chloride fume; Ammonium uriate; Katapone VV-328; Quaternary ammonium chloride

Condensed phase thermochemistry data

Quantity | Value | Units | Method | Reference | Comment |
---|---|---|---|---|---|
ΔfH°solid | -314.55 | kJ/mol | Review | Chase, 1998 | Data last reviewed in September, 1965 |
Quantity | Value | Units | Method | Reference | Comment |
S°solid | 94.85 | J/mol*K | Review | Chase, 1998 | Data last reviewed in September, 1965 |
Solid Phase Heat Capacity (Shomate Equation)
Cp° = A + B*t + C*t2 + D*t3 +
E/t2
H° − H°298.15= A*t + B*t2/2 +
C*t3/3 + D*t4/4 − E/t + F − H
S° = A*ln(t) + B*t + C*t2/2 + D*t3/3 −
E/(2*t2) + G
Cp = heat capacity (J/mol*K)
H° = standard enthalpy (kJ/mol)
S° = standard entropy (J/mol*K)
t = temperature (K) / 1000.
View plot Requires a JavaScript / HTML 5 canvas capable browser.
Temperature (K) | 298. to 458. | 458. to 1500. |
---|---|---|
A | 2101.470 | -64.43640 |
B | -11194.40 | 327.2270 |
C | 23342.30 | -149.3460 |
D | -16996.70 | 24.39640 |
E | -26.83530 | 6.432830 |
F | -706.2010 | -281.0640 |
G | 4937.300 | -24.41260 |
H | -314.5530 | -314.5530 |
Reference | Chase, 1998 | Chase, 1998 |
Comment | Data last reviewed in September, 1965 | Data last reviewed in September, 1965 |

Phase change data

Data compiled by: William E. Acree, Jr., James S. Chickos
Quantity | Value | Units | Method | Reference | Comment |
---|---|---|---|---|---|
ΔsubH° | 177. | kJ/mol | N/A | Luft, 1955 |
Enthalpy of sublimation
ΔsubH (kJ/mol) | Temperature (K) | Method | Reference |
---|---|---|---|
168.6 | 550. | I | Callanan and Smith, 1971 |
176.6 ± 0.4 | 308. to 363. | TE | Wagner and Neumann, 1961 |

Gas phase ion energetics data

Data compiled as indicated in comments:
LLK - Sharon G. Lias, Rhoda D. Levin, and Sherif A. Kafafi
B - John E. Bartmess
Electron affinity determinations
EA (eV) | Method | Reference | Comment |
---|---|---|---|
0.540 ± 0.050 | LPES | Eustis, Whiteside, et al., 2010 | B |
Appearance energy determinations
Ion | AE (eV) | Other Products | Method | Reference | Comment |
---|---|---|---|---|---|
H3N+ | 10.10 ± 0.05 | HCl | PI | Evlasheva, Potapov, et al., 1975 | LLK |
H4N+ | 10.10 ± 0.05 | Cl | PI | Evlasheva, Potapov, et al., 1975 | LLK |

Reaction thermochemistry data

Data compiled by: José A. Martinho Simões
Individual Reactions
C9H27NSn3 (cr) + ( • 55
) (solution) + 3
(l) = (
• 55
) (solution) + 3C3H10OSn (cr)
By formula: C9H27NSn3 (cr) + (HCl • 55H2O) (solution) + 3H2O (l) = (H4ClN • 55H2O) (solution) + 3C3H10OSn (cr)
Quantity | Value | Units | Method | Reference | Comment |
---|---|---|---|---|---|
ΔrH° | -293.7 ± 1.3 | kJ/mol | RSC | Baldwin, Lappert, et al., 1972 |

References

Chase, 1998
Chase, M.W., Jr.,
NIST-JANAF Themochemical Tables, Fourth Edition,
J. Phys. Chem. Ref. Data, Monograph 9, 1998, 1-1951. [all data]
Luft, 1955
Luft, N.W.,
Ind. Chemist, 1955, 31, 502. [all data]
Callanan and Smith, 1971
Callanan, Jane E.; Smith, Norman O.,
Sublimation pressures of solid solutions III. NH4Cl + NH4Br,
The Journal of Chemical Thermodynamics, 1971, 3, 4, 531-538, https://doi.org/10.1016/S0021-9614(71)80036-8
. [all data]
Wagner and Neumann, 1961
Wagner, Horst; Neumann, Kurt,
Der Dampfdruck des Ammoniumchlorids zwischen 35 und 90°C,
Zeitschrift für Physikalische Chemie, 1961, 28, 12, 51-70, https://doi.org/10.1524/zpch.1961.28.12.051
. [all data]
Eustis, Whiteside, et al., 2010
Eustis, S.N.; Whiteside, A.; Wang, D.; Gutowski, M.; Bowen, K.H.,
Ammonia-Hydrogen Bromide and Ammonia-Hydrogen Iodide Complexes: Anion Photoelectron and ab Initio Studies,
J. Phys. Chem. A, 2010, 114, 3, 1357-1363, https://doi.org/10.1021/jp906238v
. [all data]
Evlasheva, Potapov, et al., 1975
Evlasheva, T.I.; Potapov, V.K.; Tulupov, V.A.,
The structure of the ammonium chloride molecule,
Russ. J. Phys. Chem., 1975, 49, 738. [all data]