4-Biphenylamine, 4'-nitro-
- Formula: C12H10N2O2
- Molecular weight: 214.2200
- IUPAC Standard InChIKey: BOFVBIYTBGDQGY-UHFFFAOYSA-N
- CAS Registry Number: 1211-40-1
- Chemical structure:
View 3d structure (requires JavaScript / HTML 5) - Other names: 4-Amino-4'-nitrobiphenyl; 4'-Nitro-4-biphenylamine; [1,1'-Biphenyl]-4-amine, 4'-nitro-; Benzenamine, 4-(4-nitrophenyl)-

Gas phase ion energetics data

Data compiled by: Sharon G. Lias, Rhoda D. Levin, and Sherif A. Kafafi
Ionization energy determinations
IE (eV) | Method | Reference |
---|---|---|
7.46 ± 0.03 | PI | Potapov, Kardash, et al., 1972 |

References

Potapov, Kardash, et al., 1972
Potapov, V.K.; Kardash, I.E.; Sorokin, V.V.; Sokolov, S.A.; Evlasheva, T.I.,
Photoionization of heteroaromatic compounds,
Khim. Vys. Energ., 1972, 6, 392. [all data]