Biphenylchromium tricarbonyl
- Formula: C15H10CrO3
- Molecular weight: 290.2342
- IUPAC Standard InChIKey: VYLJUEVJJLQTJM-UHFFFAOYSA-N
- CAS Registry Number: 12111-60-3
- Chemical structure:
View 3d structure (requires JavaScript / HTML 5) - Permanent link for this species. Use this link for bookmarking this species for future reference.

Gas phase ion energetics data

Data compiled by: Henry M. Rosenstock, Keith Draxl, Bruce W. Steiner, and John T. Herron
Ionization energy determinations
IE (eV) | Method | Reference |
---|---|---|
7.27 | EI | Muller, 1969 |
7.35 ± 0.06 | CTS | Huttner and Fischer, 1967 |

References

Muller, 1969
Muller, J.,
Ionisierungspotentiale von substituierten Benzolchrom-tricarbonyl-Komplexen,
J. Organometal. Chem., 1969, 18, 321. [all data]
Huttner and Fischer, 1967
Huttner, G.; Fischer, E.O.,
Uber Aromatenkomplexe von Metallen. XCVIII. Spectroskopische Untersuchungen an Charge-Transfer-Komplexen von Aromaten-Chrom Tricarbonylen mit 1,3,5-Trinitrobenzol,
J. Organometal. Chem., 1967, 8, 299. [all data]