(η6-N,N-Dimethylbenzenamine) chromium tricarbonyl
- Formula: C11H11CrNO3
- Molecular weight: 257.2060
- CAS Registry Number: 12109-10-3

Gas phase thermochemistry data

Data compiled by: José A. Martinho Simões
Quantity | Value | Units | Method | Reference | Comment |
---|---|---|---|---|---|
ΔfH°gas | -336. ± 13. | kJ/mol | Review | Martinho Simões |

Condensed phase thermochemistry data

Data compiled by: José A. Martinho Simões
Quantity | Value | Units | Method | Reference | Comment |
---|---|---|---|---|---|
ΔfH°solid | -454.8 ± 8.6 | kJ/mol | Review | Martinho Simões |

Gas phase ion energetics data

Data compiled as indicated in comments:
LLK - Sharon G. Lias, Rhoda D. Levin, and Sherif A. Kafafi
RDSH - Henry M. Rosenstock, Keith Draxl, Bruce W. Steiner, and John T. Herron
Ionization energy determinations
IE (eV) | Method | Reference | Comment |
---|---|---|---|
7.38 | CTS | Kobayashi, Kobayashi, et al., 1973 | LLK |
6.92 | EI | Muller, 1969 | RDSH |
7.28 ± 0.02 | CTS | Huttner and Fischer, 1967 | RDSH |

Phase change data

Data compiled as indicated in comments:
MS - José A. Martinho Simões
AC - William E. Acree, Jr., James S. Chickos

Quantity Value Units Method Reference Comment
Δsub118. ± 10.kJ/molTD-HFCAl-Takhin, Connor, et al., 1984MS
Δsub118. ± 10.kJ/molCAl-Takhin, Connor, et al., 1984, 2AC

References

Martinho Simões
Martinho Simões, J.A.,
Private communication (see http://webbook.nist.gov/chemistry/om/). [all data]
Kobayashi, Kobayashi, et al., 1973
Kobayashi, H.; Kobayashi, M.; Kaizu, Y.,
Molecular complexes of arenetricarbonylchromium,
Bull. Chem. Soc. Jpn., 1973, 46, 3109. [all data]
Muller, 1969
Muller, J.,
Ionisierungspotentiale von substituierten Benzolchrom-tricarbonyl-Komplexen,
J. Organometal. Chem., 1969, 18, 321. [all data]
Huttner and Fischer, 1967
Huttner, G.; Fischer, E.O.,
Uber Aromatenkomplexe von Metallen. XCVIII. Spectroskopische Untersuchungen an Charge-Transfer-Komplexen von Aromaten-Chrom Tricarbonylen mit 1,3,5-Trinitrobenzol,
J. Organometal. Chem., 1967, 8, 299. [all data]