9-Anthracenecarbonitrile
- Formula: C15H9N
- Molecular weight: 203.2387
- IUPAC Standard InChIKey: KEQZHLAEKAVZLY-UHFFFAOYSA-N
- CAS Registry Number: 1210-12-4
- Chemical structure:
View 3d structure (requires JavaScript / HTML 5) - Other names: 9-Anthronitrile; 9-Cyanoanthracene; Anthracene-9-carbonitrile

Phase change data

Data compiled by: William E. Acree, Jr., James S. Chickos
Enthalpy of fusion
ΔfusH (kJ/mol) | Temperature (K) | Reference |
---|---|---|
25.19 | 445.2 | Guarini and Sarti-fantoni, 1969 |

Reaction thermochemistry data

Data compiled by: Hussein Y. Afeefy, Joel F. Liebman, and Stephen E. Stein
Individual Reactions
C30H18N2 = 2
By formula: C30H18N2 = 2C15H9N
Quantity | Value | Units | Method | Reference | Comment |
---|---|---|---|---|---|
ΔrH° | -84. | kJ/mol | Cm | Guarini and Sarti-Fantoni, 1970 | solid phase |

Gas phase ion energetics data

Data compiled as indicated in comments:
LBLHLM - Sharon G. Lias, John E. Bartmess, Joel F. Liebman, John L. Holmes, Rhoda D. Levin, and W. Gary Mallard
LLK - Sharon G. Lias, Rhoda D. Levin, and Sherif A. Kafafi
B - John E. Bartmess
Electron affinity determinations
EA (eV) | Method | Reference | Comment |
---|---|---|---|
1.27 ± 0.10 | TDEq | Heinis, Chowdhury, et al., 1993 | ΔGea(423 K)= -28.2 kcal/mol ΔSea=-1.6; B |
Ionization energy determinations
IE (eV) | Method | Reference | Comment |
---|---|---|---|
7.80 | PE | Klasinc, Kovac, et al., 1983 | LBLHLM |
7.80 ± 0.03 | PE | Klasinc, Kovac, et al., 1978 | Vertical value; LLK |

Lee's RI, non-polar column, temperature ramp

Column type | Active phase | I | Reference | Comment |
---|---|---|---|---|
Capillary | SPB-5 | 350.7 | Knobloch and Engewald, 1993 | 40. C @ 2. min, 4. K/min; Column length: 30. m; Column diameter: 0.25 mm; Tend: 300. C |

Lee's RI, non-polar column, custom temperature program

Column type | Active phase | I | Reference | Comment |
---|---|---|---|---|
Capillary | OV-101 | 357.1 | Tucminen, Wickstrom, et al., 1986 | Program: not specified |

References

Guarini and Sarti-fantoni, 1969
Guarini, G.; Sarti-fantoni, P.,
Calorimetric Study on Some Anthracene Photodimers,
Molecular Crystals, 1969, 6, 3-4, 423-426, https://doi.org/10.1080/15421407008083478
. [all data]
Guarini and Sarti-Fantoni, 1970
Guarini, G.; Sarti-Fantoni, P.,
Calorimetric study on some anthracene photodimers,
Mol. Cryst. Liq. Cryst., 1970, 6, 423-426. [all data]
Heinis, Chowdhury, et al., 1993
Heinis, T.; Chowdhury, S.; Kebarle, P.,
Electron Affinities of Naphthalene, Anthracene and Substituted Naphthalenes and Anthracenes,
Org. Mass Spectrom., 1993, 28, 4, 358, https://doi.org/10.1002/oms.1210280416
. [all data]
Klasinc, Kovac, et al., 1983
Klasinc, L.; Kovac, B.; Gusten, H.,
Photoelectron spectra of acenes. Electronic structure and substituent effects,
Pure Appl. Chem., 1983, 55, 289. [all data]
Klasinc, Kovac, et al., 1978
Klasinc, L.; Kovac, B.; Schoof, S.; Gusten, H.,
Photoelectron spectroscopy of 9-substituted anthracenes,
Croat. Chem. Acta., 1978, 51, 307. [all data]
Bol'shakov, et al., 1969
Bol'shakov, G.F., et al.,
Ultraviolet spectra of heteroorganic compounds, 1969, 178. [all data]
Knobloch and Engewald, 1993
Knobloch, T.; Engewald, W.,
Identification of some polar polycyclic compounds in emissions from brown-coal-fired residential stoves,
J. Hi. Res. Chromatogr., 1993, 16, 4, 239-242, https://doi.org/10.1002/jhrc.1240160407
. [all data]
Tucminen, Wickstrom, et al., 1986
Tucminen, A.; Wickstrom, K.; Pyysalo, H.,
Determination of Polycyclic Aromatic Compounds by GLC-Selected Ion Monitoring (SIM) Technique,
J. Hi. Res. Chromatogr. Chromatogr. Comm., 1986, 9, 8, 469-471, https://doi.org/10.1002/jhrc.1240090813
. [all data]