Pyrrolidine, 1-methyl-
- Formula: C5H11N
- Molecular weight: 85.1475
- IUPAC Standard InChIKey: AVFZOVWCLRSYKC-UHFFFAOYSA-N
- CAS Registry Number: 120-94-5
- Chemical structure:
View 3d structure (requires JavaScript / HTML 5) - Other names: N-Methylpyrrolidine; N-Methyltetrahydropyrrole; 1-Methylpyrrolidine; Methylpyrrolidine; Pyrrolidine, N-methyl; Pyrrolidine,l-methyl-

Condensed phase thermochemistry data

Data compiled by: Eugene S. Domalski and Elizabeth D. Hearing
Constant pressure heat capacity of liquid
Cp,liquid (J/mol*K) | Temperature (K) | Reference |
---|---|---|
161.1 | 298. | Conti, Gianni, et al., 1976 |

Phase change data

Data compiled as indicated in comments:
BS - Robert L. Brown and Stephen E. Stein
TRC - Thermodynamics Research Center, NIST Boulder Laboratories, Chris Muzny director
AC - William E. Acree, Jr., James S. Chickos
Quantity | Value | Units | Method | Reference | Comment |
---|---|---|---|---|---|
Tboil | 353.7 | K | N/A | Aldrich Chemical Company Inc., 1990 | BS |
Tboil | 352.5 | K | N/A | Lanum and Morris, 1969 | Uncertainty assigned by TRC = 0.15 K; TRC |
Tboil | 352.45 | K | N/A | Anonymous, 1958 | Uncertainty assigned by TRC = 0.5 K; TRC |
Quantity | Value | Units | Method | Reference | Comment |
Tfus | 179.15 | K | N/A | Anonymous, 1957 | Uncertainty assigned by TRC = 0.4 K; TRC |
Quantity | Value | Units | Method | Reference | Comment |
ΔvapH° | 34.2 ± 0.7 | kJ/mol | GS | Verevkin, 1998 | Based on data from 270. to 298. K.; AC |
Enthalpy of vaporization
ΔvapH (kJ/mol) | Temperature (K) | Method | Reference | Comment |
---|---|---|---|---|
35.0 ± 0.7 | 284. | GS | Verevkin, 1998 | Based on data from 270. to 298. K.; AC |
33.7 | 288. | A | Stephenson and Malanowski, 1987 | Based on data from 273. to 315. K.; AC |

Henry's Law data

Data compiled by: Rolf Sander
Henry's Law constant (water solution)
kH(T) = k°H exp(d(ln(kH))/d(1/T) ((1/T) - 1/(298.15 K)))
k°H = Henry's law constant for solubility in water at 298.15 K (mol/(kg*bar))
d(ln(kH))/d(1/T) = Temperature dependence constant (K)
k°H (mol/(kg*bar)) | d(ln(kH))/d(1/T) (K) | Method | Reference |
---|---|---|---|
33. | 7600. | M | N/A |

Gas phase ion energetics data

Data evaluated as indicated in comments:
HL - Edward P. Hunter and Sharon G. Lias
L - Sharon G. Lias
Data compiled as indicated in comments:
LLK - Sharon G. Lias, Rhoda D. Levin, and Sherif A. Kafafi
Quantity | Value | Units | Method | Reference | Comment |
---|---|---|---|---|---|
IE (evaluated) | ≤8.41 ± 0.02 | eV | N/A | N/A | L |
Quantity | Value | Units | Method | Reference | Comment |
Proton affinity (review) | 965.6 | kJ/mol | N/A | Hunter and Lias, 1998 | HL |
Quantity | Value | Units | Method | Reference | Comment |
Gas basicity | 934.8 | kJ/mol | N/A | Hunter and Lias, 1998 | HL |
Ionization energy determinations
IE (eV) | Method | Reference | Comment |
---|---|---|---|
8.41 ± 0.02 | PE | Aue, Webb, et al., 1976 | Vertical value; LLK |
8.41 ± 0.05 | PE | Morishima, Yoshikawa, et al., 1975 | Vertical value; LLK |
8.41 ± 0.02 | PE | Yoshikawa, Hashimoto, et al., 1974 | Vertical value; LLK |

Kovats' RI, non-polar column, isothermal

View large format table.

Column type Active phase Temperature (C) I Reference Comment
CapillaryOV-101110.680.Zhuravleva, 200050. m/0.3 mm/0.4 μm, He
PackedPMS-100130.651.Anderson, Jurel, et al., 1973He, Celite 545 (44-60 mesh); Column length: 3. m
PackedPMS-100150.654.Anderson, Jurel, et al., 1973He, Celite 545 (44-60 mesh); Column length: 3. m
PackedSE-30110.697.Tibor and Anna, 1971N2, Chromosorb W-AW; Column length: 2. m
PackedSE-3090.680.Tibor and Anna, 1971N2, Chromosorb W-AW; Column length: 2. m

Kovats' RI, polar column, isothermal

View large format table.

Column type Active phase Temperature (C) I Reference Comment
PackedPEG-2000150.849.Anderson, Jurel, et al., 1973He, Celite 545 (44-60 mesh); Column length: 3. m
PackedPEG-2000152.865.Anderson, Jurel, et al., 1973He, Celite 545 (44-60 mesh); Column length: 3. m
PackedPEG-2000179.870.Anderson, Jurel, et al., 1973He, Celite 545 (44-60 mesh); Column length: 3. m
PackedPEG-2000180.847.Anderson, Jurel, et al., 1973He, Celite 545 (44-60 mesh); Column length: 3. m
PackedPEG-2000200.844.Anderson, Jurel, et al., 1973He, Celite 545 (44-60 mesh); Column length: 3. m
PackedPEG-2000200.880.Anderson, Jurel, et al., 1973He, Celite 545 (44-60 mesh); Column length: 3. m
PackedPEG-20M110.865.Tibor and Anna, 1971N2, Chromosorb W-AW; Column length: 2. m
PackedPEG-20M90.839.Tibor and Anna, 1971N2, Chromosorb W-AW; Column length: 2. m

Van Den Dool and Kratz RI, non-polar column, temperature ramp

View large format table.

Column type Active phase I Reference Comment
PackedSE-30673.Peng, Ding, et al., 1988He, Supelcoport and Chromosorb, 40. C @ 4. min, 10. K/min, 250. C @ 60. min; Column length: 3.05 m

Normal alkane RI, non-polar column, custom temperature program

View large format table.

Column type Active phase I Reference Comment
CapillaryMethyl Silicone674.Farkas, Héberger, et al., 2004Program: not specified
CapillaryDB-1662.Kawai, Ishida, et al., 199160. m/0.25 mm/0.25 μm; Program: not specified
CapillaryDB-1665.Kawai, Ishida, et al., 199160. m/0.25 mm/0.25 μm; Program: not specified

Normal alkane RI, polar column, custom temperature program

View large format table.

Column type Active phase I Reference Comment
CapillaryDB-Wax861.Peng, Yang, et al., 1991Program: not specified

References

Conti, Gianni, et al., 1976
Conti, G.; Gianni, P.; Matteoli, E.; Mengheri, M.,
Capacita termiche molari di alcuni composti organici mono- e bifunzionali nel liquido puro e in soluzione acquosa a 25C,
Chim. Ind. (Milan), 1976, 58, 225. [all data]
Aldrich Chemical Company Inc., 1990
Aldrich Chemical Company Inc.,
Catalog Handbook of Fine Chemicals, Aldrich Chemical Company, Inc., Milwaukee WI, 1990, 1. [all data]
Lanum and Morris, 1969
Lanum, W.J.; Morris, J.C.,
Physical Properties of Some Sulfur and Nitrogen Compounds,
J. Chem. Eng. Data, 1969, 14, 93-8. [all data]
Anonymous, 1958
Anonymous, R.,
, Am. Pet. Inst. Res. Proj. 45, Ohio State Univ., 1958. [all data]
Anonymous, 1957
Anonymous, R.,
, Am. Pet. Inst. Res. Proj. 6, Carnegie-Mellon Univ., 1957. [all data]
Verevkin, 1998
Verevkin, Sergey P.,
Structural Chemistry, 1998, 9, 2, 113-119, https://doi.org/10.1023/A:1022459803871
. [all data]
Stephenson and Malanowski, 1987
Stephenson, Richard M.; Malanowski, Stanislaw,
Handbook of the Thermodynamics of Organic Compounds, 1987, https://doi.org/10.1007/978-94-009-3173-2
. [all data]
Hunter and Lias, 1998
Hunter, E.P.; Lias, S.G.,
Evaluated Gas Phase Basicities and Proton Affinities of Molecules: An Update,
J. Phys. Chem. Ref. Data, 1998, 27, 3, 413-656, https://doi.org/10.1063/1.556018
. [all data]
Aue, Webb, et al., 1976
Aue, D.H.; Webb, H.M.; Bowers, M.T.,
Quantitative proton affinities, ionization potentials, and hydrogen affinities of alkylamines,
J. Am. Chem. Soc., 1976, 98, 311. [all data]
Morishima, Yoshikawa, et al., 1975
Morishima, I.; Yoshikawa, K.; Hashimoto, M.; Bekki, K.,
Homoallylic interaction between the nitrogen lone pair and the nonadjacent π bond in cyclic and bicyclic amines. I. Photoelectron spectroscopic study,
J. Am. Chem. Soc., 1975, 97, 4283. [all data]
Yoshikawa, Hashimoto, et al., 1974
Yoshikawa, K.; Hashimoto, M.; Morishima, I.,
Photoelectron spectroscopic study of cyclic amines. The relation between ionization potentials, basicities, and s character of the nitrogen lone pair electrons,
J. Am. Chem. Soc., 1974, 96, 288. [all data]