2-Imidazolidinone
- Formula: C3H6N2O
- Molecular weight: 86.0925
- IUPAC Standard InChIKey: YAMHXTCMCPHKLN-UHFFFAOYSA-N
- CAS Registry Number: 120-93-4
- Chemical structure:
View 3d structure (requires JavaScript / HTML 5) - Other names: Ethyleneurea; Imidazolid-2-one; N,N'-Ethyleneurea; SD 6073; Urea, N,N'-(1,2-Ethanediyl)-; 2-Imidazolidone; 2-Oxoimidazolidine; Urea, 1,3-ethylene-; 1,3-Ethyleneurea; Imidazoliden-2-one; NSC 21314

Phase change data

Data compiled as indicated in comments:
TRC - Thermodynamics Research Center, NIST Boulder Laboratories, Chris Muzny director
AC - William E. Acree, Jr., James S. Chickos
Quantity | Value | Units | Method | Reference | Comment |
---|---|---|---|---|---|
Ttriple | 397.3 | K | N/A | Weinstein, Leffler, et al., 1984 | Crystal phase 1 phase; Uncertainty assigned by TRC = 1.5 K; TRC |
Quantity | Value | Units | Method | Reference | Comment |
ΔsubH° | 96.6 ± 0.8 | kJ/mol | ME | Ribeiro da Silva, Ribeiro da Silva, et al., 2008 | Based on data from 327. to 349. K.; AC |
ΔsubH° | 83.7 | kJ/mol | N/A | de Farias, de Oliveira, et al., 1999 | AC |
Enthalpy of fusion
ΔfusH (kJ/mol) | Temperature (K) | Method | Reference | Comment |
---|---|---|---|---|
11.5 | 401.2 | N/A | Ribeiro da Silva, Ribeiro da Silva, et al., 2008 | AC |
5.11 | 397.3 | DSC | Weinstein, Leffler, et al., 1984, 2 | AC |

Gas phase ion energetics data

Data compiled by: Sharon G. Lias, Rhoda D. Levin, and Sherif A. Kafafi
Ionization energy determinations
IE (eV) | Method | Reference | Comment |
---|---|---|---|
8.9 | PE | Andreocci, Devillanova, et al., 1980 | |
9.55 | PE | Andreocci, Devillanova, et al., 1980 | Vertical value |

References

Weinstein, Leffler, et al., 1984
Weinstein, D.I.; Leffler, A.J.; Currie, J.A.,
Phase Transitions in Bicyclic Compounds,
Mol. Cryst. Liq. Cryst., 1984, 104, 95. [all data]
Ribeiro da Silva, Ribeiro da Silva, et al., 2008
Ribeiro da Silva, Maria das Dores M.C.; Ribeiro da Silva, Manuel A.V.; Freitas, Vera L.S.; Roux, Maria Victoria; Jiménez, Pilar; Temprado, Manuel; Dávalos, Juan Z.; Cabildo, Pilar; Claramunt, Rosa M.; Elguero, José,
Structural studies of cyclic ureas: 1. Enthalpies of formation of imidazolidin-2-one and N,N´-trimethyleneurea,
The Journal of Chemical Thermodynamics, 2008, 40, 3, 386-393, https://doi.org/10.1016/j.jct.2007.08.004
. [all data]
de Farias, de Oliveira, et al., 1999
de Farias, Robson F.; de Oliveira, Ótom A.; de Medeiros, José V.; Claudio Airoldi, José V.,
Adducts of cyclic ureas with zinc halides -- a thermochemical study,
Thermochimica Acta, 1999, 328, 1-2, 241-246, https://doi.org/10.1016/S0040-6031(98)00648-0
. [all data]
Weinstein, Leffler, et al., 1984, 2
Weinstein, D.I.; Leffler, A.J.; Currie, J.A.,
Phase Transitions In Bicyclic Compounds,
Molecular Crystals and Liquid Crystals, 1984, 104, 1-2, 95-109, https://doi.org/10.1080/00268948408070401
. [all data]
Andreocci, Devillanova, et al., 1980
Andreocci, M.V.; Devillanova, F.A.; Furlani, C.; Mattogno, G.; Verani, G.; Zanoni, R.,
Structural characterization of some substituted azolidine molecules: UPS photoelectron spectroscopic studies,
J. Mol. Struct., 1980, 69, 151. [all data]