Chromium,(η6-benzene)(η5-2,4-cyclopentadien-1-yl)-
- Formula: C11H11Cr
- Molecular weight: 195.2011
- IUPAC Standard InChIKey: TXHJVSHWHVJQGV-UHFFFAOYSA-N
- CAS Registry Number: 12093-16-2
- Chemical structure:
View 3d structure (requires JavaScript / HTML 5) - Permanent link for this species. Use this link for bookmarking this species for future reference.

Gas phase ion energetics data

Data compiled as indicated in comments:
LLK - Sharon G. Lias, Rhoda D. Levin, and Sherif A. Kafafi
RDSH - Henry M. Rosenstock, Keith Draxl, Bruce W. Steiner, and John T. Herron
Ionization energy determinations
IE (eV) | Method | Reference | Comment |
---|---|---|---|
6.1 ± 0.1 | EI | Muller and Goser, 1968 | RDSH |
7.15 ± 0.05 | PE | Evans, Green, et al., 1974 | Vertical value; LLK |
6.2 ± 0.1 | PE | Evans, Green, et al., 1972 | Vertical value; LLK |
Appearance energy determinations
Ion | AE (eV) | Other Products | Method | Reference | Comment |
---|---|---|---|---|---|
C5H5Cr+ | 9.3 ± 0.2 | ? | EI | Muller and Goser, 1968 | RDSH |
Cr+ | 13.9 ± 0.3 | ? | EI | Muller and Goser, 1968 | RDSH |

References

Muller and Goser, 1968
Muller, J.; Goser, P.,
Massenspektroskopische Untersuchungen an Ubergangsmetall-π-Komplexen mit funf-, sechs- und siebengliedrigen aromatischen Ringliganden,
J. Organometal. Chem., 1968, 12, 163. [all data]
Evans, Green, et al., 1974
Evans, S.; Green, J.C.; Jackson, S.E.; Higginson, B.,
He(I) photoelectron spectra of some transition-metal sandwich complexes,
J. Chem. Soc. Dalton Trans., 1974, 304. [all data]
Evans, Green, et al., 1972
Evans, S.; Green, J.C.; Jackson, S.E.,
He(I) photoelectron spectra of some π-arene complexes,
J. Chem. Soc. Faraday Trans. 2, 1972, 68, 249. [all data]