2,4,5-Trioxoimidazolidine
- Formula: C3H2N2O3
- Molecular weight: 114.0596
- IUPAC Standard InChIKey: ZFLIKDUSUDBGCD-UHFFFAOYSA-N
- CAS Registry Number: 120-89-8
- Chemical structure:
View 3d structure (requires JavaScript / HTML 5) - Other names: Imidazolidinetrione; Parabanic acid; 2,4,5-Imidazolinetrione; Imidazole-trione; Oxalylurea; Trioxoimidazolidine

Phase change data

Data compiled by: William E. Acree, Jr., James S. Chickos
Quantity | Value | Units | Method | Reference | Comment |
---|---|---|---|---|---|
ΔsubH° | 119.4 ± 0.6 | kJ/mol | ME | Ribeiro da Silva, Ribeiro da Silva, et al., 2008 | Based on data from 381. to 406. K. |
Enthalpy of sublimation
ΔsubH (kJ/mol) | Temperature (K) | Method | Reference | Comment |
---|---|---|---|---|
114.6 ± 0.6 | 393.7 | ME | Ribeiro da Silva, Ribeiro da Silva, et al., 2008 | Based on data from 381. to 406. K. |

Gas phase ion energetics data

Data compiled by: Sharon G. Lias, Rhoda D. Levin, and Sherif A. Kafafi
Ionization energy determinations
IE (eV) | Method | Reference |
---|---|---|
10.67 | PE | Meeks, Arnett, et al., 1975 |

References

Ribeiro da Silva, Ribeiro da Silva, et al., 2008
Ribeiro da Silva, Maria das Dores M.C.; Ribeiro da Silva, Manuel A.V.; Freitas, Vera L.S.; Roux, Maria Victoria; Jiménez, Pilar; Dávalos, Juan Z.; Cabildo, Pilar; Claramunt, Rosa M.; Elguero, José,
Structural studies of cyclic ureas: 2. Enthalpy of formation of parabanic acid,
The Journal of Chemical Thermodynamics, 2008, 40, 9, 1378-1385, https://doi.org/10.1016/j.jct.2008.05.006
. [all data]
Meeks, Arnett, et al., 1975
Meeks, J.L.; Arnett, J.F.; Larson, D.; McGlynn, S.P.,
Photoelectron spectroscopy of carbonyls. Ionization assignments,
Chem. Phys. Lett., 1975, 30, 190. [all data]
Johnson, 1966
Johnson, E.A.,
UV atlas of organic compounds, 1966, 1, B11/6. [all data]