(η6-1,3,5-Trimethylbenzene) molybdenum tricarbonyl
- Formula: C12H12MoO3
- Molecular weight: 300.18
- CAS Registry Number: 12089-15-5

Condensed phase thermochemistry data

Data compiled by: José A. Martinho Simões
Quantity | Value | Units | Method | Reference | Comment |
---|---|---|---|---|---|
ΔfH°solid | -533. ± 13. | kJ/mol | Review | Martinho Simões | |
ΔfH°solid | -495.7 ± 4.5 | kJ/mol | Review | Martinho Simões | |
Quantity | Value | Units | Method | Reference | Comment |
ΔcH°solid | -6686.0 ± 4.2 | kJ/mol | CC-SB | Tel'noi and Rabinovich, 1977 |

Phase change data

Data compiled by: José A. Martinho Simões
Quantity | Value | Units | Method | Reference | Comment |
---|---|---|---|---|---|
ΔsubH° | 109.0 ± 6.0 | kJ/mol | HAL-HFC, TD-HFC | Brown, Connor, et al., 1977 |

Gas phase ion energetics data

Data compiled by: Sharon G. Lias, Rhoda D. Levin, and Sherif A. Kafafi
Ionization energy determinations
IE (eV) | Method | Reference | Comment |
---|---|---|---|
7.37 | PE | Worley and Webb, 1980 | Vertical value |
7.35 ± 0.05 | PE | Gower, Kane-Maguire, et al., 1977 | Vertical value |

Gas phase thermochemistry data

Data compiled by: José A. Martinho Simões
Quantity | Value | Units | Method | Reference | Comment |
---|---|---|---|---|---|
ΔfH°gas | -424. ± 14. | kJ/mol | Review | Martinho Simões | |
ΔfH°gas | -386.7 ± 7.5 | kJ/mol | Review | Martinho Simões |

References

Martinho Simões
Martinho Simões, J.A.,
Private communication (see http://webbook.nist.gov/chemistry/om/). [all data]
Tel'noi and Rabinovich, 1977
Tel'noi, V.I.; Rabinovich, I.B.,
Russ. Chem. Rev., 1977, 46, 689. [all data]
Brown, Connor, et al., 1977
Brown, D.L.S.; Connor, J.A.; Demain, C.P.; Leung, M.L.; Martinho Simões, J.A.; Skinner, H.A.; Zafarani- Moattar, M.T.,
J. Organometal. Chem., 1977, 142, 321. [all data]
Worley and Webb, 1980
Worley, S.D.; Webb, T.R.,
The electronic structure of transition-metal carbonyl complexes of norbornadiene and mesitylene,
J. Organomet. Chem., 1980, 192, 139. [all data]
Gower, Kane-Maguire, et al., 1977
Gower, M.; Kane-Maguire, L.A.P.; Maier, J.P.; Sweigart, D.A.,
Ultraviolet photoelectron spectra of cyclohepta-1,3,5-triene and mesitylene tricarbonyl complexes of the group 6A metals,
J. Chem. Soc. Dalton Trans., 1977, 316. [all data]