Chromium, tricarbonyl[(1,2,3,4,5,6-η)-hexamethylbenzene]-
- Formula: C15H18CrO3
- Molecular weight: 298.2977
- IUPAC Standard InChIKey: QHYWVVUQIBPVLG-UHFFFAOYSA-N
- CAS Registry Number: 12088-11-8
- Chemical structure:

Gas phase thermochemistry data

Data compiled by: José A. Martinho Simões
Quantity | Value | Units | Method | Reference | Comment |
---|---|---|---|---|---|
ΔfH°gas | -562. ± 14. | kJ/mol | Review | Martinho Simões | |
ΔfH°gas | -538. ± 13. | kJ/mol | Review | Martinho Simões |

Condensed phase thermochemistry data

Data compiled by: José A. Martinho Simões
Quantity | Value | Units | Method | Reference | Comment |
---|---|---|---|---|---|
ΔfH°solid | -685. ± 13. | kJ/mol | Review | Martinho Simões | |
ΔfH°solid | -662. ± 12. | kJ/mol | Review | Martinho Simões |

Gas phase ion energetics data

Data compiled as indicated in comments:
LLK - Sharon G. Lias, Rhoda D. Levin, and Sherif A. Kafafi
RDSH - Henry M. Rosenstock, Keith Draxl, Bruce W. Steiner, and John T. Herron
Ionization energy determinations
IE (eV) | Method | Reference | Comment |
---|---|---|---|
6.4 ± 0.1 | EI | Gilbert, Leach, et al., 1973 | LLK |
6.88 | EI | Muller, 1969 | RDSH |
7.24 ± 0.05 | CTS | Huttner and Fischer, 1967 | RDSH |
7.00 | PE | Connor, Martinho-Simoes, et al., 1979 | Vertical value; LLK |
Appearance energy determinations
Ion | AE (eV) | Other Products | Method | Reference | Comment |
---|---|---|---|---|---|
C11H12O2Cr+ | 6.5 ± 0.1 | CO | EI | Gilbert, Leach, et al., 1973 | LLK |
C12H18+ | 8.6 ± 0.1 | ? | EI | Gilbert, Leach, et al., 1973 | LLK |
C12H18Cr+ | 9.8 ± 0.1 | 3CO | EI | Gilbert, Leach, et al., 1973 | LLK |
C13H18OCr+ | 7.7 ± 0.1 | 2CO | EI | Gilbert, Leach, et al., 1973 | LLK |
Cr+ | 13.0 ± 0.1 | ? | EI | Gilbert, Leach, et al., 1973 | LLK |

Phase change data

Data compiled as indicated in comments:
MS - José A. Martinho Simões
AC - William E. Acree, Jr., James S. Chickos
Quantity | Value | Units | Method | Reference | Comment |
---|---|---|---|---|---|
ΔsubH° | 123.4 ± 4.2 | kJ/mol | HAL-HFC | Adedeji, Brown, et al., 1975 | MS |
ΔsubH° | 123.0 ± 4.0 | kJ/mol | C | Adedeji, Lalage, et al., 1975 | See also Brown, Connor, et al., 1977.; AC |

References

Martinho Simões
Martinho Simões, J.A.,
Private communication (see http://webbook.nist.gov/chemistry/om/). [all data]
Gilbert, Leach, et al., 1973
Gilbert, J.R.; Leach, W.P.; Miller, J.R.,
Ionisation appearance potential measurements in arene chromium tricarbonyls,
J. Organomet. Chem., 1973, 49, 219. [all data]
Muller, 1969
Muller, J.,
Ionisierungspotentiale von substituierten Benzolchrom-tricarbonyl-Komplexen,
J. Organometal. Chem., 1969, 18, 321. [all data]
Huttner and Fischer, 1967
Huttner, G.; Fischer, E.O.,
Uber Aromatenkomplexe von Metallen. XCVIII. Spectroskopische Untersuchungen an Charge-Transfer-Komplexen von Aromaten-Chrom Tricarbonylen mit 1,3,5-Trinitrobenzol,
J. Organometal. Chem., 1967, 8, 299. [all data]
Connor, Martinho-Simoes, et al., 1979
Connor, J.A.; Martinho-Simoes, J.A.; Skinner, H.A.; Zafarani-Moattar, M.T.,
Thermochemistry of bis-arene arenetricarbonyl-chromium compounds containing hexamethylbenzene, 1,3,5-tri-methylbenzene and naphthalene,
J. Organomet. Chem., 1979, 179, 331. [all data]