Rhodium, bis(η2-ethene)(2,4-pentanedionato-O,O')-
- Formula: C9H15O2Rh
- Molecular weight: 258.1197
- IUPAC Standard InChIKey: FLRBEQQDEGBCJS-FGSKAQBVSA-M
- CAS Registry Number: 12082-47-2
- Chemical structure:
View 3d structure (requires JavaScript / HTML 5) - Other names: Rhodium, bis(ethylene)(2,4-pentanedionato)-; (Acetylacetonato)bis(ethylene)rhodium; Acetylacetonatobis(ethylene)rhodium(I); Bis(ethylene)(2,4-pentanedionato)rhodium; Bis(ethylene)rhodium(I) acetylacetonate; Bisethylenerhodium acetylacetonate; Diethylene(acetylacetonato)rhodium; 2,4-Pentanedionatobis(ethylene)rhodium; Acetylacetonatobis(ethylene)rhodium(1); bis(η2-ethylene)(pentane-2,4-dionato-O,O')rhodium

Phase change data

Data compiled as indicated in comments:
MS - José A. Martinho Simões
AC - William E. Acree, Jr., James S. Chickos
Quantity | Value | Units | Method | Reference | Comment |
---|---|---|---|---|---|
ΔsubH° | 97.9 ± 3.8 | kJ/mol | N/A | Jesse, Ernsting, et al., 1978 | MS |
Enthalpy of sublimation
ΔsubH (kJ/mol) | Temperature (K) | Method | Reference | Comment |
---|---|---|---|---|
97.9 ± 7.1 | 292. | ME | Jesse, Ernsting, et al., 1978, 2 | Based on data from 282. to 301. K. See also Stephenson and Malanowski, 1987.; AC |

Reaction thermochemistry data

Data compiled by: José A. Martinho Simões
Individual Reactions
(solution) +
(solution) = C13H19O2Rh (solution) + 2
(solution)
By formula: C9H15O2Rh (solution) + C8H12 (solution) = C13H19O2Rh (solution) + 2C2H4 (solution)
Quantity | Value | Units | Method | Reference | Comment |
---|---|---|---|---|---|
ΔrH° | -9.0 ± 0.4 | kJ/mol | RSC | Jesse, Cordfunke, et al., 1979 | solvent: n-Heptane |
By formula: C9H15O2Rh (cr) + 2CO (g) = C7H7O4Rh (cr) + 2C2H4 (g)
Quantity | Value | Units | Method | Reference | Comment |
---|---|---|---|---|---|
ΔrH° | -53.6 ± 1.7 | kJ/mol | DSC | Jesse, Baks, et al., 1978 |

Gas phase ion energetics data

Data compiled by: Sharon G. Lias, Rhoda D. Levin, and Sherif A. Kafafi
Ionization energy determinations
IE (eV) | Method | Reference | Comment |
---|---|---|---|
7.17 | PE | Van Dam, Terpstra, et al., 1980 | |
7.54 | PE | Van Dam, Terpstra, et al., 1980 | Vertical value |

References

Jesse, Ernsting, et al., 1978
Jesse, A.C.; Ernsting, J.M.; Stufkens, D.J.; Vrieze, K.,
Thermochim. Acta, 1978, 25, 69. [all data]
Jesse, Ernsting, et al., 1978, 2
Jesse, A.C.; Ernsting, J.M.; Stufkens, D.J.; Vrieze, K.,
Vapour pressure measurements on (acac)M(substituted olefin)2 and (acac)M(CO)2 (M = Rh(I), Ir(I)),
Thermochimica Acta, 1978, 25, 1, 69-75, https://doi.org/10.1016/0040-6031(78)80041-0
. [all data]
Stephenson and Malanowski, 1987
Stephenson, Richard M.; Malanowski, Stanislaw,
Handbook of the Thermodynamics of Organic Compounds, 1987, https://doi.org/10.1007/978-94-009-3173-2
. [all data]
Jesse, Cordfunke, et al., 1979
Jesse, A.C.; Cordfunke, E.H.P.; Ouweltjes, W.,
Thermochim. Acta, 1979, 30, 293. [all data]
Jesse, Baks, et al., 1978
Jesse, A.C.; Baks, A.; Stufkens, D.J.; Vrieze, K.,
Inorg. Chim. Acta, 1978, 29, 177. [all data]
Van Dam, Terpstra, et al., 1980
Van Dam, H.; Terpstra, A.; Stufkens, D.J.; Oskam, A.,
UV photoelectron spectroscopic studies of the metal-olefin bond. 2. Bonding in (β-diketonato)rhodium(I) and -iridium(I) carbonyl and olefin complexes,
Inorg. Chem., 1980, 19, 3448. [all data]