(η6-Chlorobenzene) chromium tricarbonyl
- Formula: C9H5ClCrO3
- Molecular weight: 248.583
- CAS Registry Number: 12082-03-0

Phase change data

Data compiled as indicated in comments:
AC - William E. Acree, Jr., James S. Chickos
MS - José A. Martinho Simões
Quantity | Value | Units | Method | Reference | Comment |
---|---|---|---|---|---|
ΔsubH° | 102.5 ± 4.2 | kJ/mol | N/A | Pilcher and Skinner, 1983 | See also Adedeji, Lalage, et al., 1975.; AC |
ΔsubH° | 102.5 ± 4.2 | kJ/mol | TD-HFC | Adedeji, Brown, et al., 1975 | MS |

Gas phase ion energetics data

Data compiled as indicated in comments:
LLK - Sharon G. Lias, Rhoda D. Levin, and Sherif A. Kafafi
RDSH - Henry M. Rosenstock, Keith Draxl, Bruce W. Steiner, and John T. Herron
Ionization energy determinations
IE (eV) | Method | Reference | Comment |
---|---|---|---|
7.0 ± 0.1 | EI | Gilbert, Leach, et al., 1973 | LLK |
7.37 | EI | Muller, 1969 | RDSH |
Appearance energy determinations
Ion | AE (eV) | Other Products | Method | Reference | Comment |
---|---|---|---|---|---|
C6H5Cl+ | 9.2 ± 0.1 | ? | EI | Gilbert, Leach, et al., 1973 | LLK |
C6H5ClCr+ | 10.1 ± 0.1 | 3CO | EI | Gilbert, Leach, et al., 1973 | LLK |
C7H5OClCr+ | 8.2 ± 0.1 | 2CO | EI | Gilbert, Leach, et al., 1973 | LLK |
C8H5O2ClCr+ | 7.5 ± 0.1 | CO | EI | Gilbert, Leach, et al., 1973 | LLK |
Cr+ | 14.1 ± 0.1 | C6H5Cl+3CO | EI | Gilbert, Leach, et al., 1973 | LLK |

Gas phase thermochemistry data

Data compiled by: José A. Martinho Simões
Quantity | Value | Units | Method | Reference | Comment |
---|---|---|---|---|---|
ΔfH°gas | -363.3 ± 6.1 | kJ/mol | Review | Martinho Simões |

Condensed phase thermochemistry data

Data compiled by: José A. Martinho Simões
Quantity | Value | Units | Method | Reference | Comment |
---|---|---|---|---|---|
ΔfH°solid | -465.8 ± 4.4 | kJ/mol | Review | Martinho Simões |

References

Pilcher and Skinner, 1983
Pilcher, G.; Skinner, H.A.,
Thermochemistry of organometallic compounds, 1983, 43-90, https://doi.org/10.1002/9780470771686.ch2
. [all data]
Adedeji, Lalage, et al., 1975
Adedeji, Festus A.; Lalage, D.; Brown, S.; Connor, Joseph A.; Leung, May L.; Paz-Andrade, I. Maria; Skinner, Henry A.,
Thermochemistry of arene chromium tricarbonyls and the strenghts of arene-chromium bonds,
Journal of Organometallic Chemistry, 1975, 97, 2, 221-228, https://doi.org/10.1016/S0022-328X(00)89468-1
. [all data]
Adedeji, Brown, et al., 1975
Adedeji, F.A.; Brown, D.L.S.; Connor, J.A.; Leung, M.; Paz-Andrade, I.M.; Skinner, H.A.,
J. Organometal. Chem., 1975, 97, 221. [all data]
Gilbert, Leach, et al., 1973
Gilbert, J.R.; Leach, W.P.; Miller, J.R.,
Ionisation appearance potential measurements in arene chromium tricarbonyls,
J. Organomet. Chem., 1973, 49, 219. [all data]
Muller, 1969
Muller, J.,
Ionisierungspotentiale von substituierten Benzolchrom-tricarbonyl-Komplexen,
J. Organometal. Chem., 1969, 18, 321. [all data]