Bromobenzenechromium tricarbonyl
- Formula: C9H5BrCrO3
- Molecular weight: 293.034
- IUPAC Standard InChIKey: IKNYBAQZAOICCC-UHFFFAOYSA-N
- CAS Registry Number: 12082-02-9
- Chemical structure:
View 3d structure (requires JavaScript / HTML 5) - Permanent link for this species. Use this link for bookmarking this species for future reference.

Gas phase ion energetics data

Data compiled by: Henry M. Rosenstock, Keith Draxl, Bruce W. Steiner, and John T. Herron
Ionization energy determinations
IE (eV) | Method | Reference |
---|---|---|
7.40 | EI | Muller, 1969 |

References

Muller, 1969
Muller, J.,
Ionisierungspotentiale von substituierten Benzolchrom-tricarbonyl-Komplexen,
J. Organometal. Chem., 1969, 18, 321. [all data]