Rhenium, tricarbonyl(η5-2,4-cyclopentadien-1-yl)-
- Formula: C8H5O3Re
- Molecular weight: 335.330
- IUPAC Standard InChIKey: CMNHOYLCNXAAGB-UHFFFAOYSA-N
- CAS Registry Number: 12079-73-1
- Chemical structure:
View 3d structure (requires JavaScript / HTML 5) - Other names: Rhenium, tricarbonyl-π-cyclopentadienyl-; Tricarbonyl(π-cyclopentadienyl)rhenium; Tricarbonylcyclopentadienylrhenium; Rhenium, tricarbonyl(η5-cyclopentadienyl)-

Gas phase ion energetics data

Data compiled by: Sharon G. Lias, Rhoda D. Levin, and Sherif A. Kafafi
Ionization energy determinations
IE (eV) | Method | Reference | Comment |
---|---|---|---|
8.05 | PE | Calabro, Hubbard, et al., 1981 | Vertical value |
8.13 | PE | Lichtenberger and Fenske, 1976 | Vertical value |

References

Calabro, Hubbard, et al., 1981
Calabro, D.C.; Hubbard, J.L.; Blevins, C.H., II; Campbell, A.C.; Lichtenberger, D.L.,
The effects of methyl group substitution on metal-coordinated cyclopentadienyl rings. The core and valence ionizations of methylated tricarbonyl(η5-cyclopentadienyl)metal complexes,
J. Am. Chem. Soc., 1981, 103, 6839. [all data]
Lichtenberger and Fenske, 1976
Lichtenberger, D.L.; Fenske, R.F.,
The helium(I) photoelectron spectra and electronic structure of (η5-Cyclopentadienyl) d6 metal carbonyls,
J. Am. Chem. Soc., 1976, 98, 50. [all data]