Ethanedithioamide, N,N'-dimethyl-
- Formula: C4H8N2S2
- Molecular weight: 148.250
- IUPAC Standard InChIKey: MQLIZYQZJMPNFI-UHFFFAOYSA-N
- CAS Registry Number: 120-79-6
- Chemical structure:
View 3d structure (requires JavaScript / HTML 5) - Other names: Oxamide, N,N'-dimethyldithio-; N,N'-Dimethyldithiooxamide; CH3NHCSCSNHCH3; USAF mk-4

Gas phase ion energetics data

Data compiled by: Sharon G. Lias, Rhoda D. Levin, and Sherif A. Kafafi
Ionization energy determinations
IE (eV) | Method | Reference | Comment |
---|---|---|---|
8.23 | PE | Henriksen, Isaksson, et al., 1981 | Vertical value |

References

Henriksen, Isaksson, et al., 1981
Henriksen, L.; Isaksson, R.; Liljefors, T.; Sandstrom, J.,
Ultraviolet absorption and photoelectron spectra of some cyclic and open-chain mono- and dithiooxamides,
Acta Chem. Scand., Ser. B, 1981, 35, 489. [all data]
Lang (editor), 1962
Lang (editor), L.,
Absorption Spectra ih the Ultraviolet and Visible Region, 1962, 3, 58. [all data]