Cyclopentadienyliron dicarboxyl iodide
- Formula: C7H5FeIO2
- Molecular weight: 303.863
- IUPAC Standard InChIKey: PNLPBVANFPNCSW-UHFFFAOYSA-M
- CAS Registry Number: 12078-28-3
- Chemical structure:

Gas phase ion energetics data

Data compiled by: Sharon G. Lias, Rhoda D. Levin, and Sherif A. Kafafi
Ionization energy determinations
IE (eV) | Method | Reference | Comment |
---|---|---|---|
7.77 | PE | Lichtenberger and Fenske, 1976 | Vertical value |
7.81 | PE | Symon and Waddington, 1975 | Vertical value |

References

Lichtenberger and Fenske, 1976
Lichtenberger, D.L.; Fenske, R.F.,
The helium(I) photoelectron spectra and electronic structure of (η5-Cyclopentadienyl) d6 metal carbonyls,
J. Am. Chem. Soc., 1976, 98, 50. [all data]
Symon and Waddington, 1975
Symon, D.A.; Waddington, T.C.,
Valence-band photoelectron spectra of some dicarbonyl(η-cyclopentadienyl)(ligand)iron compounds and tetrakis [carbonyl(η-cyclopentadienyl)iron(1)],
J. Chem. Soc. Dalton Trans., 1975, 2140. [all data]