Nickel, bis(η3-2-propenyl)-
- Formula: C6H10Ni
- Molecular weight: 140.8370
- IUPAC Standard InChIKey: KAZNYNMOFMMRRS-UHFFFAOYSA-N
- CAS Registry Number: 12077-85-9
- Chemical structure:
View 3d structure (requires JavaScript / HTML 5) - Permanent link for this species. Use this link for bookmarking this species for future reference.

Gas phase ion energetics data

Data compiled by: Sharon G. Lias, Rhoda D. Levin, and Sherif A. Kafafi
Ionization energy determinations
IE (eV) | Method | Reference | Comment |
---|---|---|---|
7.33 ± 0.04 | PE | Lloyd and Lynaugh, 1972 | |
7.76 | PE | Bohm, Gleiter, et al., 1980 | Vertical value |
7.76 | PE | Batich, 1976 | Vertical value |

References

Lloyd and Lynaugh, 1972
Lloyd, D.R.; Lynaugh, N.,
Photoelectron Spectra of the bis(π-allyl) complexes of nickel and palladium
in Electron Spectroscopy, ed D.A. Shirely (North-Holland Publ Co., Amsterdam), 1972, 445. [all data]
Bohm, Gleiter, et al., 1980
Bohm, M.C.; Gleiter, R.; Batich, C.D.,
106. The photoelectron spectra of (Ni, Pd, Pt-Diallyl),
Helv. Chim. Acta, 1980, 63, 990. [all data]
Batich, 1976
Batich, C.,
Photoelectron spectroscopy of bis(π-allyl) nickel and its methyl substituted derivatives: support for the near validity of Koopmans' Theorem,
J. Am. Chem. Soc., 1976, 98, 7585. [all data]