10H-Phenothiazine, 10-methyl-
- Formula: C13H11NS
- Molecular weight: 213.298
- IUPAC Standard InChIKey: QXBUYALKJGBACG-UHFFFAOYSA-N
- CAS Registry Number: 1207-72-3
- Chemical structure:
View 3d structure (requires JavaScript / HTML 5) - Other names: Phenothiazine, 10-methyl-; N-Methylphenothiazine; 10-Methylphenothiazine; Phenothiazide methyl derivative; 9,10-Dibenzoisothiazine, 10-methyl-; 10-methyl-10H-phenothiazine

Gas phase ion energetics data

Data compiled by: Sharon G. Lias, Rhoda D. Levin, and Sherif A. Kafafi
Ionization energy determinations
IE (eV) | Method | Reference | Comment |
---|---|---|---|
6.73 ± 0.07 | CTS | Poltorakov, Pirnazarova, et al., 1973 | |
7.15 ± 0.07 | PE | Domelsmith, Munchausen, et al., 1977 | Vertical value |

References

Poltorakov, Pirnazarova, et al., 1973
Poltorakov, A.P.; Pirnazarova, F.N.; But, P.G.; Piruzyan, L.A.; Chibrikin, V.M.; Vikjlyaev, Yu.I.; Ul'yanova, O.V.,
Ionization potentials of phenothiazine derivatives and their correlation with the parmacologic effect,
Bull. Acad. Sci. USSR, Div. Chem. Sci., 1973, 22, 2050, In original 2106. [all data]
Domelsmith, Munchausen, et al., 1977
Domelsmith, L.N.; Munchausen, L.L.; Houk, K.N.,
Photoelectron spectra of psychotropic drugs. 2. Phenothiazine and related tranquilizers,
J. Am. Chem. Soc., 1977, 99, 6506. [all data]