9H-Purine
- Formula: C5H4N4
- Molecular weight: 120.1121
- IUPAC Standard InChIKey: KDCGOANMDULRCW-UHFFFAOYSA-N
- CAS Registry Number: 120-73-0
- Chemical structure:
View 3d structure (requires JavaScript / HTML 5) - Other names: 7H-Purine; 1H-Purine; Purine; β-Purine; Isopurine; 3,5,7-Triazaindole; 6H-Imidazo[4,5-d]pyrimidine; Imidazo(4,5-d)pyrimidine; NSC 753; X 128; 7H-Imidazo(4,5-d)pyrimidine

Condensed phase thermochemistry data

Data compiled as indicated in comments:
ALS - Hussein Y. Afeefy, Joel F. Liebman, and Stephen E. Stein
DH - Eugene S. Domalski and Elizabeth D. Hearing
Quantity | Value | Units | Method | Reference | Comment |
---|---|---|---|---|---|
ΔfH°solid | Ccb | Zaheeruddin and Lodhi, 1991 | uncertain value: 2238.05 kJ/mol; ALS | ||
ΔfH°solid | 169.4 ± 2.7 | kJ/mol | Ccr | Kirklin and Domalski, 1984 | ALS |
Quantity | Value | Units | Method | Reference | Comment |
ΔcH°solid | Ccb | Zaheeruddin and Lodhi, 1991 | uncertain value: -4777.28 kJ/mol; ALS | ||
ΔcH°solid | -2708.6 ± 2.3 | kJ/mol | Ccr | Kirklin and Domalski, 1984 | ALS |
Constant pressure heat capacity of solid
Cp,solid (J/mol*K) | Temperature (K) | Reference | Comment |
---|---|---|---|
106.9 | 298.15 | Kirklin and Domalski, 1984 | DH |

Gas phase ion energetics data

Data evaluated as indicated in comments:
HL - Edward P. Hunter and Sharon G. Lias
Data compiled as indicated in comments:
LLK - Sharon G. Lias, Rhoda D. Levin, and Sherif A. Kafafi
RDSH - Henry M. Rosenstock, Keith Draxl, Bruce W. Steiner, and John T. Herron
Quantity | Value | Units | Method | Reference | Comment |
---|---|---|---|---|---|
Proton affinity (review) | 920.1 | kJ/mol | N/A | Hunter and Lias, 1998 | HL |
Quantity | Value | Units | Method | Reference | Comment |
Gas basicity | 888.2 | kJ/mol | N/A | Hunter and Lias, 1998 | HL |
Ionization energy determinations
IE (eV) | Method | Reference | Comment |
---|---|---|---|
9.7 ± 0.1 | EI | Lifschitz, Bergmann, et al., 1967 | RDSH |
9.52 ± 0.03 | PE | Hush and Cheung, 1975 | Vertical value; LLK |

References

Zaheeruddin and Lodhi, 1991
Zaheeruddin, M.; Lodhi, Z.H.,
Enthalpies of formation of some cyclic compounds,
Phys. Chem. (Peshawar Pak.), 1991, 10, 111-118. [all data]
Kirklin and Domalski, 1984
Kirklin, D.R.; Domalski, E.S.,
Enthalpy of combustion of purine,
J. Chem. Thermodyn., 1984, 16, 633-641. [all data]
Hunter and Lias, 1998
Hunter, E.P.; Lias, S.G.,
Evaluated Gas Phase Basicities and Proton Affinities of Molecules: An Update,
J. Phys. Chem. Ref. Data, 1998, 27, 3, 413-656, https://doi.org/10.1063/1.556018
. [all data]
Lifschitz, Bergmann, et al., 1967
Lifschitz, C.; Bergmann, E.D.; Pullman, B.,
The ionization potentials of biological purines and pyrimidines,
Tetrahedron Lett., 1967, 4583. [all data]
Hush and Cheung, 1975
Hush, N.S.; Cheung, A.S.,
Ionization potentials and donor properties of nucleic acid bases and related compounds,
Chem. Phys. Lett., 1975, 34, 11. [all data]