Rhodium, compound with titanium(1:2)
- Formula: RhTi2
- Molecular weight: 198.639
- IUPAC Standard InChIKey: VXKQJVJMDOTDFF-UHFFFAOYSA-N
- CAS Registry Number: 12067-05-9
- Chemical structure:
View 3d structure (requires JavaScript / HTML 5) - Permanent link for this species. Use this link for bookmarking this species for future reference.

Gas phase ion energetics data

Data compiled by: Sharon G. Lias, Rhoda D. Levin, and Sherif A. Kafafi
Ionization energy determinations
IE (eV) | Method | Reference |
---|---|---|
7.9 ± 1.0 | EI | Cocke and Gingerich, 1974 |

References

Cocke and Gingerich, 1974
Cocke, D.L.; Gingerich, K.A.,
Thermodynamic investigation of the gaseous molecules TiRh, Rh2, and Ti2Rh by mass spectrometry,
J. Chem. Phys., 1974, 60, 1958. [all data]