Acetamide, N-(2-methylphenyl)-
- Formula: C9H11NO
- Molecular weight: 149.1897
- IUPAC Standard InChIKey: BPEXTIMJLDWDTL-UHFFFAOYSA-N
- CAS Registry Number: 120-66-1
- Chemical structure:
View 3d structure (requires JavaScript / HTML 5) - Other names: o-Acetotoluidide; o-Acetotoluide; o-Methylacetanilide; N-Acetyl-o-toluidine; 2'-Methylacetanilide; Acetyl-o-toluidine; Acet-o-toluidide; 2-Methylacetanilide; N-o-Tolylacetamide; N-Acetyl-2-toluidine; NSC 3365

Condensed phase thermochemistry data

Data compiled by: Hussein Y. Afeefy, Joel F. Liebman, and Stephen E. Stein
Quantity | Value | Units | Method | Reference | Comment |
---|---|---|---|---|---|
ΔfH°solid | -242.43 ± 0.79 | kJ/mol | Ccb | Ryskalieva, Erkasov, et al., 1991 | |
Quantity | Value | Units | Method | Reference | Comment |
ΔcH°solid | -4871.35 ± 0.79 | kJ/mol | Ccb | Ryskalieva, Erkasov, et al., 1991 | |
ΔcH°solid | -4921.97 | kJ/mol | Ccb | Swarts, 1909 |

Phase change data

Data compiled as indicated in comments:
BS - Robert L. Brown and Stephen E. Stein
AC - William E. Acree, Jr., James S. Chickos
Quantity | Value | Units | Method | Reference | Comment |
---|---|---|---|---|---|
Tboil | 569.2 | K | N/A | Weast and Grasselli, 1989 | BS |
Enthalpy of sublimation
ΔsubH (kJ/mol) | Temperature (K) | Reference | Comment |
---|---|---|---|
96.8 | 327.5 | Stephenson and Malanowski, 1987 | Based on data from 315. to 340. K. See also Aihara, 1960.; AC |
Enthalpy of fusion
ΔfusH (kJ/mol) | Temperature (K) | Method | Reference | Comment |
---|---|---|---|---|
21.7 | 382.7 | DSC | Huang, 2003 | See also Huang, Tang, et al., 2005.; AC |

Gas phase ion energetics data

Data compiled by: Sharon G. Lias, Rhoda D. Levin, and Sherif A. Kafafi
Ionization energy determinations
IE (eV) | Method | Reference | Comment |
---|---|---|---|
8.03 ± 0.02 | EI | Benezra and Bursey, 1972 | |
8.34 | PE | Nakagaki, Kobayashi, et al., 1980 | Vertical value |
Appearance energy determinations
Ion | AE (eV) | Other Products | Method | Reference | Comment |
---|---|---|---|---|---|
C7H8N+ | 13.97 ± 0.02 | CH3CO | EI | Benezra and Bursey, 1972 | |
C7H9N+ | 10.05 ± 0.02 | CH2=C=O | EI | Benezra and Bursey, 1972 |

References

Ryskalieva, Erkasov, et al., 1991
Ryskalieva, A.K.; Erkasov, R.Sh.; Abramova, G.V.; Nurakhmetov, N.N.,
Thermochemistry of o-methylacetanilide and 2',4'-dimethylacetanilide,
Izv. Vyssh. Uchebn. Zaved., Khim. Khim. Tekhnol., 1991, 34, 25-28. [all data]
Swarts, 1909
Swarts, M.F.,
Sur la chaleur de formation de l'aniline et de quelquesuns de ses derives,
Recl. Trav. Chim. Pays-Bas, 1909, 28, 155-165. [all data]
Weast and Grasselli, 1989
CRC Handbook of Data on Organic Compounds, 2nd Editon, Weast,R.C and Grasselli, J.G., ed(s)., CRC Press, Inc., Boca Raton, FL, 1989, 1. [all data]
Stephenson and Malanowski, 1987
Stephenson, Richard M.; Malanowski, Stanislaw,
Handbook of the Thermodynamics of Organic Compounds, 1987, https://doi.org/10.1007/978-94-009-3173-2
. [all data]
Aihara, 1960
Aihara, Ariyuki,
Estimation of the Energy of Hydrogen Bonds Formed in Crystals. III. Amides,
Bull. Chem. Soc. Jpn., 1960, 33, 9, 1188-1194, https://doi.org/10.1246/bcsj.33.1188
. [all data]
Huang, 2003
Huang, C.-Y.,
, M.S. Thesis, Chinese Culture University, 2003. [all data]
Huang, Tang, et al., 2005
Huang, Chih-Yung; Tang, Muoi; Chen, Yan-Ping,
Solid-Liquid Equilibria for 3-Aminophenol + 2-Aminophenol, 4-(Acetylamino)toluene + 2-(Acetylamino)toluene, and 3,4,5-Trimethoxybenzoic Acid + 2,4,5-Trimethoxybenzoic Acid,
J. Chem. Eng. Data, 2005, 50, 1, 40-43, https://doi.org/10.1021/je049878m
. [all data]
Benezra and Bursey, 1972
Benezra, S.A.; Bursey, M.M.,
Hydrogen bonding in mass spectral activated complexes. A correction,
J. Chem. Soc. Perkin Trans. 2, 1972, 11, 1537. [all data]
Nakagaki, Kobayashi, et al., 1980
Nakagaki, R.; Kobayashi, T.; Nagakura, S.,
Conformations of acetanilide and related compounds studied by ultraviolet photoelectron spectroscopy,
Bull. Chem. Soc. Jpn., 1980, 53, 901. [all data]